{"text_format":"1","workbook":"xlsx","n_sheets":5,"sheets":["DADOS","BDI (1)","PO","PLQ","CFF"],"not_rendered":{"charts":0,"images":9,"macros":1,"external_links":0,"defined_names":122,"comments":0,"pivot_tables":0},"unopened":[],"bounds":{"document_bytes":16777216,"sheet_cells":100000,"rows_first":2000,"rows_last":500,"rows_between":2000,"halvings":0,"cell_chars":16384,"cell_head_chars":4096},"cells_cut":0,"cells_raw":0,"read":"whole","date_system":"1900"}

{"sheet":"DADOS","index":0,"n_rows":230,"n_cols":24,"rows_kept":230,"cut":false,"hidden":false,"merged":[[220,2,220,4],[219,5,219,8],[220,5,220,8],[219,15,219,23],[220,15,220,23],[27,9,27,14],[31,6,31,9],[30,10,30,15],[31,10,31,15],[27,15,27,23],[30,16,30,23],[31,16,31,23],[30,0,30,5],[27,2,27,4],[28,2,28,4],[27,5,27,8],[28,5,28,8],[31,0,31,5],[30,6,30,9],[28,15,28,23],[28,9,28,14],[66,0,66,23],[87,0,87,23],[42,10,42,12],[229,14,229,19],[228,7,228,8],[228,10,228,12],[228,14,228,19],[229,22,229,23],[223,16,223,23],[222,10,222,15],[79,0,79,23],[82,0,82,23],[229,0,229,1],[229,20,229,21],[229,10,229,12],[220,9,220,14],[226,6,226,18],[228,0,228,1],[228,2,228,6],[229,2,229,6],[229,7,229,8],[223,10,223,15],[222,16,222,23],[225,3,225,5],[84,0,84,23],[220,0,220,1],[222,0,222,5],[223,0,223,5],[223,6,223,9],[222,6,222,9],[219,2,219,4],[86,0,86,23],[228,22,228,23],[228,20,228,21],[42,7,42,8],[226,0,226,1],[225,6,225,18],[225,0,225,1],[219,0,219,1],[226,3,226,5],[47,0,47,2],[56,7,56,10],[53,1,53,4],[64,0,64,23],[54,7,54,10],[44,0,44,23],[62,0,62,23],[49,0,49,23],[54,1,54,4],[56,1,56,4],[53,7,53,10],[0,1,1,23],[55,7,55,10],[41,22,41,23],[36,0,36,1],[41,0,41,1],[42,22,42,23],[42,14,42,19],[42,2,42,6],[41,10,41,12],[42,20,42,21],[34,0,34,23],[36,6,36,18],[36,3,36,5],[3,0,3,23],[5,0,5,23],[7,0,7,23],[23,0,23,23],[13,0,13,23],[9,0,9,23],[11,0,11,23],[41,7,41,8],[55,1,55,4],[41,14,41,19],[42,0,42,1],[219,9,219,14],[98,0,98,23],[97,0,97,23],[96,0,96,23],[25,0,25,23],[27,0,27,1],[28,0,28,1],[68,0,68,23],[59,0,59,23],[61,0,61,23],[100,0,100,23],[94,0,94,23],[95,0,95,23],[37,0,37,1],[41,20,41,21],[69,0,69,23],[39,0,39,23],[99,0,99,23],[73,0,73,23],[80,0,80,23],[89,0,89,23],[92,0,92,23],[93,0,93,23],[91,0,91,23],[37,6,37,18],[85,0,85,23],[37,3,37,5],[41,2,41,6],[67,0,67,23],[77,0,77,23],[70,0,70,23],[71,0,71,23],[15,0,15,23],[17,0,17,23],[21,0,21,8],[75,0,75,23],[83,0,83,23],[76,0,76,23],[78,0,78,23],[81,0,81,23]]}
[27476,"PO - Planilha Orçamentária / PLQ - Planilha de Levantamento de Quantidades / CFF - Cronograma Físico Financeiro"]
["v008"]
[]
["INSTRUÇÕES DE USO E PREENCHIMENTO"]
[]
["1. Este documento somente pode ser utilizado nas versões do Excel 2003 ou superior. Não deve ser utilizado versões do BROffice. O Documento deve ser salvo SOMENTE em extensão habilitada para macros (.xls ou .xlsm). Se o documento for salvo na extensão .xlsx, o arquivo será INUTILIZADO. "]
[]
["2. Para funcionamento pleno desse arquivo, a Segurança de Macros do Excel deve ser habilitada."]
[]
["2.1  Na Versão Excel 2003, selecione na Faixa de Opções: Ferramentas --> Macro --> Segurança --> Na aba Nível de Segurança selecione a Opção \"Baixo\" --> Clique em OK --> Feche e abra o Excel novamente para utilizar a Planilha."]
[]
["2.2 Na Versão Excel 2007 ou superior, selecione na Faixa de Opções: Arquivo --> Opções --> Central de Confiabilidade --> Configurações da Central de Confiabilidade --> Configurações de Macro --> Habilitar todas as Macros --> Clique em OK --> Feche e abra o excel novamente para utilizar a Planilha."]
[]
["3. O Preenchimento deve ser feito somente nas células em amarelo. As outras células são de preenchimento Automático."]
[]
["4. Preferências de Elaboração do Orçamento"]
[]
["4.1. Preenchimento de Quantidades"]
[]
[]
[]
["5. Ordem de Preenchimento"]
[]
["5.1. na Aba DADOS"]
[]
["5.1.1. Preencha no Quadro abaixo os Dados do TC/CR:"]
[]
["Nº OPERAÇÃO",null,"GESTOR",null,null,"PROGRAMA",null,null,null,"AÇÃO / MODALIDADE",null,null,null,null,null,"OBJETO"]
[863113,null,"MINISTÉRIO DO DESENVOLVIMENTO SOCIAL",null,null," ESTRUTURACAO DA REDE DE SERVICOS DE PROTECAO SOCIAL BÁSICA",null,null,null,"CONSTRUÇÃO DE UM CENTRO DE REFERÊNCIA DE ASSISTÊNCIA SOCIAL",null,null,null,null,null,"CONSTRUÇÃO DE UM CENTRO DE REFERÊNCIA DE ASSISTÊNCIA SOCIAL - CRAS"]
[]
["PROPONENTE / TOMADOR",null,null,null,null,null,"MUNICÍPIO / UF",null,null,null,"LOCALIDADE / ENDEREÇO",null,null,null,null,null,"APELIDO DO EMPREENDIMENTO"]
["MUNICÍPIO DE CASEIROS",null,null,null,null,null,"CASEIROS/RS",null,null,null,"AV. JOSÉ FRANCISCO MENDES, 272 - CENTRO"]
[]
[]
["5.1.2. Preencha no quadro abaixo as informações sobre o orçamento:"]
[]
["DATA BASE",null,"DESON.","LOCALIDADE DO SINAPI",null,null,"DESCRIÇÃO DO LOTE",null,null,null,null,null,null,null,null,null,null,null,null,"BDI 1","BDI 2","BDI 3","BDI 4","BDI 5"]
["2018-06-01",null,"Sim","Porto Alegre / RS",null,null,"CONSTRUÇÃO DE UM CRAS",null,null,null,null,null,null,null,null,null,null,null,null,{"$f":"IF(ISERROR(INDIRECT(\"'BDI (\"&RIGHT(T37,1)&\")'!N27\")),\"\",INDIRECT(\"'BDI (\"&RIGHT(T37,1)&\")'!N27\"))","v":0.26390000000000002},{"$f":"IF(ISERROR(INDIRECT(\"'BDI (\"&RIGHT(U37,1)&\")'!N27\")),\"\",INDIRECT(\"'BDI (\"&RIGHT(U37,1)&\")'!N27\"))","v":""},{"$f":"IF(ISERROR(INDIRECT(\"'BDI (\"&RIGHT(V37,1)&\")'!N27\")),\"\",INDIRECT(\"'BDI (\"&RIGHT(V37,1)&\")'!N27\"))","v":""},{"$f":"IF(ISERROR(INDIRECT(\"'BDI (\"&RIGHT(W37,1)&\")'!N27\")),\"\",INDIRECT(\"'BDI (\"&RIGHT(W37,1)&\")'!N27\"))","v":""},{"$f":"IF(ISERROR(INDIRECT(\"'BDI (\"&RIGHT(X37,1)&\")'!N27\")),\"\",INDIRECT(\"'BDI (\"&RIGHT(X37,1)&\")'!N27\"))","v":""}]
[]
["4.1.2. Preencha no quadro abaixo as informações sobre o orçamento licitado:"]
[]
["CTEF n.º",null,"NOME DA EMPRESA ",null,null,null,null,"DATA BASE",null,"DESON.","REGIME DE EXECUÇÃO",null,null,"ACOMP.","OBJETO CTEF",null,null,null,null,null,"DATA ASSINATURA",null,"VIGÊNCIA"]
[]
[]
["5.1.3. Preencha a data de Início da Obra:"]
[]
["DATA INÍCIO"]
["2018-09-01"]
[]
["5.1.4. Preencha no(s) Quadro(s) abaixo os Dados do(s) Responsável(is) Técnico(s) pela elaboração do Orçamento:"]
[]
[null,null,null,null,null,null,"Exibir o 2° Quadro de Assinatura?",null,null,null,"NÃO"]
[]
["Nome:",null,null,null,null,null,"Nome:"]
[{"$f":"IF(OR(TipoOrçamento=\"BASE\",TipoOrçamento=\"REPROGRAMADONPL\"),\"Título:\",\"Cargo:\")","v":"Cargo:"},null,null,null,null,null,{"$f":"A55","v":"Cargo:"}]
[{"$f":"IF(OR(TipoOrçamento=\"BASE\",TipoOrçamento=\"REPROGRAMADONPL\"),\"CREA/CAU:\",\"Empresa:\")","v":"Empresa:"},null,null,null,null,null,{"$f":"A56","v":"Empresa:"}]
[{"$f":"IF(OR(TipoOrçamento=\"BASE\",TipoOrçamento=\"REPROGRAMADONPL\"),\"ART/RRT:\",\"CNPJ:\")","v":"CNPJ:"},null,null,null,null,null,{"$f":"A57","v":"CNPJ:"}]
[]
[]
["5.2. Legenda das Abas"]
[]
["5.2.1.  LARANJA: Aba DADOS. Preenchimento Obrigatório. Impressão Dispensada."]
["5.2.2.  AMARELO: Abas BDI, PO, PLQ e CFF. Preenchimento e Impressão Obrigatórias. O preenchimento da Aba BDI é dispensada para os casos de Aquisição Direta de Materiais e Equipamentos. A Impressão da Aba PLQ pode ser dispensada para casos de Frente de Obra Única."]
[]
["5.3. na Aba BDI (Bonificações e Despesas Indiretas):"]
[]
["5.3.1. Escolha o tipo de empreendimento."]
["5.3.2. Escolha se o BDI será do tipo desonerado ou não (aba DADOS)"]
["5.3.3. Informe a base de cálculo do ISS (0 a 100%)."]
["5.3.4. Informe a alíquota do ISS (Normalmente de 2 a 5%)."]
["5.3.5. Defina na tabela os percentuais a serem adotados para cada item que compõe o BDI nos campos em amarelo."]
["5.3.6. Preencha o campo observações se necessário (recomendado para os orçamentos que utilizam mais de um BDI)."]
[]
["5.4. na Aba PO (Planilha Orçamentária):"]
[]
["5.4.1. Primeiramente, selecione os níveis de cada item do orçamento na coluna NÍVEL."]
["5.4.1.1: O nível de \"Serviço\" serve tanto para serviços ou insumos (mão-de-obra / material / equipamento / veículo / máquina / ferramenta / etc). Um \"nível 2/3/4\" é um título (é preenchida apenas a coluna descrição) utilizado para organizar melhor a planilha orçamentária e engloba (agrupa) serviços e agrupadores de nível inferior."]
["5.4.2. Após a seleção dos níveis, preencha, para cada serviço, as informações sobre a Fonte de Referência, (SINAPI, SICRO, SIURB, etc) e o respectivo Código de Referência."]
["5.4.3. Esta planilha é compatível com o arquivo REFERÊNCIA distribuído pela CAIXA. Caso o arquivo REFERÊNCIA esteja aberto, será possível buscar um código através do botão \"Buscar Código\". Desta forma a descrição dos serviços será preenchida automaticamente (podendo ser substituída). Caso contrário, seu preenchimento deve ser manual."]
["5.4.3.1. As descrições e unidades preenchidas automaticamente ficarão vinculadas ao arquivo REFERÊNCIA até que se use o botão \"Fixar Descrições\", que quebra a fórmula e transforma as descrições em texto."]
["5.4.4. Preencher o custo unitário do serviço/insumo na Coluna CUSTO UNITÁRIO. ATENÇÃO: o custo unitário adotado deve ser menor ou igual ao contido na tabela de referência ou mediana das cotações de mercado."]
["5.4.5. Indicar o BDI adotado para cada serviço/insumo na Coluna BDI. Preferencialmente selecione uma das opções da lista suspensa que aparecerá na célula, esta lista contém os 05 BDIs que podem ser preenchidos na Aba BDI (conforme item 5.2 das instruções). Caso seja necessária a adoção de mais de 05 valores diferentes de BDI, digite o percentual diretamente na célula."]
["5.4.6. Conforme selecionado no item 4.1. desta Aba, a Coluna Quantidade pode ser preenchida diretamente na PO, ou representar a soma das quantidades de cada Frente de Obra, informadas na aba PLQ (Planilha de Levantamento de Quantitativos)."]
["5.4.7. OBSERVAÇÃO: As demais colunas (Item / Quantidade / Preço Unitário / Preço Total) são de preenchimento automático. Não tente preenche-las ou alterá-las na Aba PO."]
["5.4.8. Se for necessário acrescentar ou excluir linhas da Planilha Orçamentária, utilize o Botão EDITAR PLANILHA e selecione as opções no quadro.\nATENÇÃO: quanto maior o número de linhas mais lento será o processamento dos dados, então acrescente apenas o número necessário ou um pouco a mais."]
["5.4.8.1. Evite deixar linhas em branco no corpo da Planilha Orçamentária."]
["5.4.9. Caso deseje importar os dados de outro arquivo utilize apenas a opção COLAR ESPECIAL ==> VALORES."]
["5.4.10. Clique no Botão LICITAR / REPROGRAMAR para preencher o Orçamento Licitado ou Reprogramado."]
[]
["5.5. na Aba PLQ (Planilha de Levantamento de Quantitativos):"]
[]
["5.5.1. Preencha primeiramente as Frentes de Obra."]
["5.5.1.1. Exemplos de Frentes de Obra (Rua A trecho 01 / Rua A trecho 02 / Rua B ; UH 01 / UH 02 / UH 03). "]
["5.5.2. Preencha as quantidades dos serviços por frente de obra. A soma das quantidades de todas as frentes de um determinado serviço será a quantidade exibida na Planilha Orçamentária."]
["5.5.3. Caso deseje incluir ou excluir frentes, utilize os botões ADICIONAR e EXCLUIR."]
[]
["5.6. na Aba CFF (Cronograma Físico-Financeiro):"]
[]
["5.6.1. Preencha a data de início da obra na aba Dados."]
["5.6.2. Preencha as porcentagens previstas por parcela para cada meta ou macrosserviço."]
["5.6.3. Para atualizar o Cronograma conforme o Orçamento e incluir ou excluir parcelas, utilize o botão EDITAR / ATUALIZAR CRONOGRAMA."]
[]
[]
[]
[]
[]
[null,null,null,null,null,null,null,null,null,null,null,"(Selecione uma Localidade)"]
[null,null,null,null,null,null,null,null,null,null,null,"Aracaju / SE",null,null,null,null,null,null,{"$f":"T38","v":0.26390000000000002}]
[null,null,null,null,null,null,null,null,null,null,null,"Belém / PA",null,null,null,null,null,null,{"$f":"U38","v":""}]
[null,null,null,null,null,null,null,null,null,null,null,"Belo Horizonte / MG",null,null,null,null,null,null,{"$f":"V38","v":""}]
[null,null,null,null,null,null,null,null,null,null,null,"Boa Vista / RR",null,null,null,null,null,null,{"$f":"W38","v":""}]
[null,null,null,null,null,null,null,null,null,null,null,"Brasília / DF",null,null,null,null,null,null,{"$f":"X38","v":""}]
[null,null,null,null,null,null,null,null,null,null,null,"Campo Grande / MS"]
[null,null,null,null,null,null,null,null,null,null,null,"Cuiabá / MT"]
[null,null,null,null,null,null,null,null,null,null,null,"Curitiba / PR",null,null,null,"Empreitada Preço Global"]
[null,null,null,null,null,null,null,null,null,null,null,"Florianópolis / SC",null,null,null,"Empreitada Preço Unitário"]
[null,null,null,null,null,null,null,null,null,null,null,"Fortaleza / CE",null,null,null,"Empreitada Integral"]
[null,null,null,null,null,null,null,null,null,null,null,"Goiânia / GO",null,null,null,"Tarefa"]
[null,null,null,null,null,null,null,null,null,null,null,"João Pessoa / PB",null,null,null,"Contratação Integrada"]
[null,null,null,null,null,null,null,null,null,null,null,"Macapá / AP",null,null,null,"Não se aplica"]
[null,null,null,null,null,null,null,null,null,null,null,"Maceió / AL"]
[null,null,null,null,null,null,null,null,null,null,null,"Manaus / AM",null,null,null,"BM"]
[null,null,null,null,null,null,null,null,null,null,null,"Natal / RN",null,null,null,"PLE"]
[null,null,null,null,null,null,null,null,null,null,null,"Palmas / TO"]
[null,null,null,null,null,null,null,null,null,null,null,"Porto Alegre / RS"]
[null,null,null,null,null,null,null,null,null,null,null,"Porto Velho / RO"]
[null,null,null,null,null,null,null,null,null,null,null,"Recife / PE"]
[null,null,null,null,null,null,null,null,null,null,null,"Rio Branco / AC"]
[null,null,null,null,null,null,null,null,null,null,null,"Rio de Janeiro / RJ"]
[null,null,null,null,null,null,null,null,null,null,null,"Salvador / BA"]
[null,null,null,null,null,null,null,null,null,null,null,"São Luís / MA"]
[null,null,null,null,null,null,null,null,null,null,null,"São Paulo / SP"]
[null,null,null,null,null,null,null,null,null,null,null,"Teresina / PI"]
[null,null,null,null,null,null,null,null,null,null,null,"Vitória / ES"]
[]
[]
[]
[]
[]
[]
[]
[]
[]
[]
[]
[]
[]
[]
[]
[]
[]
[]
[]
[]
[]
[]
[]
[]
[]
[]
[]
[]
[]
[]
[]
[]
[]
[]
[]
[]
[]
[]
[]
[]
[]
[]
[]
[]
[]
[]
[]
[]
[]
[]
[]
[]
[]
[]
[]
[]
[]
[]
[]
[]
[]
[]
[]
[]
[]
[]
[]
[]
[]
[]
[]
[]
[]
[]
[]
[]
[]
[]
[]
[]
[]
[]
[]
[]
[]
[{"$f":"A28","v":"Nº OPERAÇÃO"},null,{"$f":"C28","v":"GESTOR"},null,null,{"$f":"F28","v":"PROGRAMA"},null,null,null,{"$f":"J28","v":"AÇÃO / MODALIDADE"},null,null,null,null,null,{"$f":"P28","v":"OBJETO"}]
[{"$f":"IF(A29=\"\",\"\",A29)","v":863113},null,{"$f":"IF(C29=\"\",\"\",C29)","v":"MINISTÉRIO DO DESENVOLVIMENTO SOCIAL"},null,null,{"$f":"IF(F29=\"\",\"\",F29)","v":" ESTRUTURACAO DA REDE DE SERVICOS DE PROTECAO SOCIAL BÁSICA"},null,null,null,{"$f":"IF(J29=\"\",\"\",J29)","v":"CONSTRUÇÃO DE UM CENTRO DE REFERÊNCIA DE ASSISTÊNCIA SOCIAL"},null,{"$f":"IF(#REF!=\"\",\"\",#REF!)","v":{"$error":"#REF!"}},null,{"$f":"IF(#REF!=\"\",\"\",#REF!)","v":{"$error":"#REF!"}},null,{"$f":"IF(P29=\"\",\"\",P29)","v":"CONSTRUÇÃO DE UM CENTRO DE REFERÊNCIA DE ASSISTÊNCIA SOCIAL - CRAS"}]
[]
[{"$f":"A31","v":"PROPONENTE / TOMADOR"},null,null,null,null,null,{"$f":"G31","v":"MUNICÍPIO / UF"},null,null,null,{"$f":"K31","v":"LOCALIDADE / ENDEREÇO"},null,null,null,null,null,{"$f":"Q31","v":"APELIDO DO EMPREENDIMENTO"}]
[{"$f":"IF(A32=\"\",\"\",A32)","v":"MUNICÍPIO DE CASEIROS"},null,null,null,null,null,{"$f":"IF(G32=\"\",\"\",G32)","v":"CASEIROS/RS"},{"$f":"IF(I32=\"\",\"\",I32)","v":""},null,{"$f":"IF(#REF!=\"\",\"\",#REF!)","v":{"$error":"#REF!"}},{"$f":"IF(K32=\"\",\"\",K32)","v":"AV. JOSÉ FRANCISCO MENDES, 272 - CENTRO"},null,null,null,null,null,{"$f":"IF(Q32=\"\",\"\",Q32)","v":""}]
[]
[{"$f":"A37","v":"DATA BASE"},null,{"$f":"C37","v":"DESON."},{"$f":"D37","v":"LOCALIDADE DO SINAPI"},null,null,{"$f":"G37","v":"DESCRIÇÃO DO LOTE"},null,null,null,null,null,null,null,null,null,null,null,null,{"$f":"T37","v":"BDI 1"},{"$f":"U37","v":"BDI 2"},{"$f":"V37","v":"BDI 3"},{"$f":"W37","v":"BDI 4"},{"$f":"X37","v":"BDI 5"}]
[{"$f":"IF(A38=\"\",\"\",A38)","v":"2018-06-01"},null,{"$f":"IF(C38=\"\",\"\",C38)","v":"Sim"},"Porto Alegre / RS","","","CONSTRUÇÃO DE UM CRAS","","","","","","","","","","","","",0.26390000000000002,"","","",""]
[]
["CTEF n.º",null,"NOME DA EMPRESA / CNPJ:",null,null,null,null,"DATA BASE",null,"DESON.","REGIME DE EXECUÇÃO",null,null,"ACOMP.","OBJETO CTEF",null,null,null,null,null,"DATA ASSINATURA",null,"VIGÊNCIA"]
[{"$f":"IF(A43=\"\",\"\",A43)","v":""},null,{"$f":"IF(C43=\"\",\"\",C43)","v":""},null,{"$f":"IF(E43=\"\",\"\",E43)","v":""},null,{"$f":"IF(G43=\"\",\"\",G43)","v":""},{"$f":"IF(H43=\"\",\"\",H43)","v":""},{"$f":"IF(I43=\"\",\"\",I43)","v":""},{"$f":"IF(J43=\"\",\"\",J43)","v":""},{"$f":"IF(K43=\"\",\"\",K43)","v":""},null,{"$f":"IF(M43=\"\",\"\",M43)","v":""},{"$f":"IF(N43=\"\",\"\",N43)","v":""},{"$f":"IF(O43=\"\",\"\",O43)","v":""},null,{"$f":"IF(Q43=\"\",\"\",Q43)","v":""},null,{"$f":"IF(S43=\"\",\"\",S43)","v":""},null,{"$f":"IF(U43=\"\",\"\",U43)","v":""},null,{"$f":"IF(W43=\"\",\"\",W43)","v":""}]

{"sheet":"BDI (1)","index":1,"n_rows":59,"n_cols":23,"rows_kept":59,"cut":false,"hidden":true,"merged":[[47,15,47,17],[44,8,44,11],[42,8,42,11],[12,16,12,17],[13,8,13,15],[13,16,13,17],[15,12,16,12],[12,8,12,15],[15,15,16,15],[15,16,16,16],[15,13,16,13],[15,8,16,11],[15,14,16,14],[10,8,10,15],[10,16,10,17],[3,8,3,9],[3,10,3,17],[4,8,4,9],[4,10,4,17],[6,8,6,17],[7,8,7,17],[9,8,9,15],[9,16,9,17],[15,19,23,20],[41,8,41,11],[17,8,17,11],[18,8,18,11],[19,8,19,11],[20,8,20,11],[21,8,21,11],[22,8,22,11],[23,8,23,11],[24,8,24,11],[15,17,16,17],[36,8,36,17],[31,15,32,15],[31,12,31,14],[32,12,32,14],[31,11,32,11],[49,9,49,11],[28,9,28,17],[25,8,25,11],[26,8,26,11],[26,15,26,17],[44,14,44,17],[30,8,30,17],[34,8,34,17],[41,14,41,17],[48,9,48,11],[39,8,39,17],[45,8,45,11],[45,14,45,17],[46,9,46,11],[46,15,46,17],[47,9,47,11]]}
[null,null,null,null,"MIN","MED","MAX",null,null,null,null,null,null,{"$f":"\"Quadro de Composição do BDI \"&MID(CELL(\"nome.arquivo\",N1),5+FIND(\"BDI (\",CELL(\"nome.arquivo\",N1)),1)","v":"Quadro de Composição do BDI 1"}]
["Construção e Reforma de Edifícios","AC",{"$f":"CONCATENATE(A2,\"-\",B2)","v":"Construção e Reforma de Edifícios-AC"},null,0.03,0.04,5.5E-2]
[{"$f":"A2","v":"Construção e Reforma de Edifícios"},"SG","Construção e Reforma de Edifícios-SG",null,8.0000000000000002E-3,8.0000000000000002E-3,0.01]
[{"$f":"A3","v":"Construção e Reforma de Edifícios"},"R","Construção e Reforma de Edifícios-R",null,9.7000000000000003E-3,1.2699999999999999E-2,1.2699999999999999E-2,null,"Nº TC/CR",null,"PROPONENTE / TOMADOR"]
[{"$f":"A4","v":"Construção e Reforma de Edifícios"},"DF","Construção e Reforma de Edifícios-DF",null,5.8999999999999999E-3,1.23E-2,1.3899999999999999E-2,null,{"$f":"DADOS!A29","v":863113},null,{"$f":"DADOS!A32","v":"MUNICÍPIO DE CASEIROS"}]
[{"$f":"A5","v":"Construção e Reforma de Edifícios"},"L","Construção e Reforma de Edifícios-L",null,6.1600000000000002E-2,7.400000000000001E-2,8.9600000000000013E-2]
[{"$f":"A6","v":"Construção e Reforma de Edifícios"},"BDI PAD","Construção e Reforma de Edifícios-BDI PAD",null,0.2034,0.22120000000000001,0.25,null,"OBJETO"]
["Construção de Praças Urbanas, Rodovias, Ferrovias e recapeamento e pavimentação de vias urbanas","AC","Construção de Praças Urbanas, Rodovias, Ferrovias e recapeamento e pavimentação de vias urbanas-AC",null,3.7999999999999999E-2,4.0099999999999997E-2,4.6699999999999998E-2,null,{"$f":"DADOS!P29","v":"CONSTRUÇÃO DE UM CENTRO DE REFERÊNCIA DE ASSISTÊNCIA SOCIAL - CRAS"}]
["Construção de Praças Urbanas, Rodovias, Ferrovias e recapeamento e pavimentação de vias urbanas","SG","Construção de Praças Urbanas, Rodovias, Ferrovias e recapeamento e pavimentação de vias urbanas-SG",null,3.2000000000000002E-3,4.0000000000000001E-3,7.4000000000000003E-3]
["Construção de Praças Urbanas, Rodovias, Ferrovias e recapeamento e pavimentação de vias urbanas","R","Construção de Praças Urbanas, Rodovias, Ferrovias e recapeamento e pavimentação de vias urbanas-R",null,5.0000000000000001E-3,5.6000000000000008E-3,9.7000000000000003E-3,null,"TIPO DE OBRA DO EMPREENDIMENTO",null,null,null,null,null,null,null,"DESONERAÇÃO"]
["Construção de Praças Urbanas, Rodovias, Ferrovias e recapeamento e pavimentação de vias urbanas","DF","Construção de Praças Urbanas, Rodovias, Ferrovias e recapeamento e pavimentação de vias urbanas-DF",null,1.0200000000000001E-2,1.11E-2,1.21E-2,null,"Construção e Reforma de Edifícios",null,null,null,null,null,null,null,{"$f":"DADOS!$C$38","v":"Sim"}]
["Construção de Praças Urbanas, Rodovias, Ferrovias e recapeamento e pavimentação de vias urbanas","L","Construção de Praças Urbanas, Rodovias, Ferrovias e recapeamento e pavimentação de vias urbanas-L",null,6.6400000000000001E-2,7.2999999999999995E-2,8.6899999999999991E-2]
["Construção de Praças Urbanas, Rodovias, Ferrovias e recapeamento e pavimentação de vias urbanas","BDI PAD","Construção de Praças Urbanas, Rodovias, Ferrovias e recapeamento e pavimentação de vias urbanas-BDI PAD",null,0.19600000000000001,0.2097,0.24230000000000002,null,"Conforme legislação tributária municipal, definir estimativa de percentual da base de cálculo para o ISS:",null,null,null,null,null,null,null,1]
["Construção de Redes de Abastecimento de Água, Coleta de Esgoto","AC","Construção de Redes de Abastecimento de Água, Coleta de Esgoto-AC",null,3.4300000000000004E-2,4.9299999999999997E-2,6.7099999999999993E-2,null,"Sobre a base de cálculo, definir a respectiva alíquota do ISS (entre 2% e 5%):",null,null,null,null,null,null,null,0.02]
[{"$f":"A14","v":"Construção de Redes de Abastecimento de Água, Coleta de Esgoto"},"SG","Construção de Redes de Abastecimento de Água, Coleta de Esgoto-SG",null,2.8000000000000004E-3,4.8999999999999998E-3,7.4999999999999997E-3]
[null,null,null,null,null,null,null,null,"Itens",null,null,null,"Siglas","% Adotado","Situação","1º Quartil","Médio","3º Quartil",null,{"$f":"IF(V27,\"Para BDI fora do intervalo estatístico, deve ser apresentado Relatório Técnico Circunstanciado justificando a adoção do percentual de cada parcela do BDI.\",\"\")","v":""}]
[{"$f":"A15","v":"Construção de Redes de Abastecimento de Água, Coleta de Esgoto"},"R","Construção de Redes de Abastecimento de Água, Coleta de Esgoto-R",null,0.01,1.3899999999999999E-2,1.7399999999999999E-2]
[{"$f":"A17","v":"Construção de Redes de Abastecimento de Água, Coleta de Esgoto"},"DF","Construção de Redes de Abastecimento de Água, Coleta de Esgoto-DF",null,9.3999999999999986E-3,9.8999999999999991E-3,1.1699999999999999E-2,null,{"$f":"IF($I$11=$A$59,\"Encargos Sociais incidentes sobre a mão de obra\",\"Administração Central\")","v":"Administração Central"},null,null,null,{"$f":"IF($I$11=$A$59,\"K1\",\"AC\")","v":"AC"},3.9E-2,"-",{"$f":"VLOOKUP(CONCATENATE(I$11,\"-\",M18),$C$2:$G$49,3,FALSE)","v":0.03},{"$f":"VLOOKUP(CONCATENATE(I$11,\"-\",M18),$C$2:$G$49,4,FALSE)","v":0.04},{"$f":"VLOOKUP(CONCATENATE(I$11,\"-\",M18),$C$2:$G$49,5,FALSE)","v":5.5E-2}]
[{"$f":"A18","v":"Construção de Redes de Abastecimento de Água, Coleta de Esgoto"},"L","Construção de Redes de Abastecimento de Água, Coleta de Esgoto-L",null,6.7400000000000002E-2,8.0399999999999985E-2,9.4E-2,null,{"$f":"IF($I$11=$A$59,\"Administração Central da empresa ou consultoria - overhead\",\"Seguro e Garantia\")","v":"Seguro e Garantia"},null,null,null,{"$f":"IF($I$11=$A$59,\"K2\",\"SG\")","v":"SG"},8.0000000000000002E-3,"-",{"$f":"VLOOKUP(CONCATENATE(I$11,\"-\",M19),$C$2:$G$49,3,FALSE)","v":8.0000000000000002E-3},{"$f":"VLOOKUP(CONCATENATE(I$11,\"-\",M19),$C$2:$G$49,4,FALSE)","v":8.0000000000000002E-3},{"$f":"VLOOKUP(CONCATENATE(I$11,\"-\",M19),$C$2:$G$49,5,FALSE)","v":0.01}]
[{"$f":"A19","v":"Construção de Redes de Abastecimento de Água, Coleta de Esgoto"},"BDI PAD","Construção de Redes de Abastecimento de Água, Coleta de Esgoto-BDI PAD",null,0.20760000000000001,0.24179999999999999,0.26440000000000002,null,{"$f":"IF($I$11=$A$59,\"\",\"Risco\")","v":"Risco"},null,null,null,{"$f":"IF($I$11=$A$59,\"\",\"R\")","v":"R"},9.7000000000000003E-3,"-",{"$f":"VLOOKUP(CONCATENATE(I$11,\"-\",M20),$C$2:$G$49,3,FALSE)","v":9.7000000000000003E-3},{"$f":"VLOOKUP(CONCATENATE(I$11,\"-\",M20),$C$2:$G$49,4,FALSE)","v":1.2699999999999999E-2},{"$f":"VLOOKUP(CONCATENATE(I$11,\"-\",M20),$C$2:$G$49,5,FALSE)","v":1.2699999999999999E-2}]
["Construção e Manutenção de Estações e Redes de Distribuição de Energia Elétrica","AC","Construção e Manutenção de Estações e Redes de Distribuição de Energia Elétrica-AC",null,5.2900000000000003E-2,5.9200000000000003E-2,7.9299999999999995E-2,null,{"$f":"IF($I$11=$A$59,\"\",\"Despesas Financeiras\")","v":"Despesas Financeiras"},null,null,null,{"$f":"IF($I$11=$A$59,\"\",\"DF\")","v":"DF"},1.23E-2,"-",{"$f":"VLOOKUP(CONCATENATE(I$11,\"-\",M21),$C$2:$G$49,3,FALSE)","v":5.8999999999999999E-3},{"$f":"VLOOKUP(CONCATENATE(I$11,\"-\",M21),$C$2:$G$49,4,FALSE)","v":1.23E-2},{"$f":"VLOOKUP(CONCATENATE(I$11,\"-\",M21),$C$2:$G$49,5,FALSE)","v":1.3899999999999999E-2}]
[{"$f":"A21","v":"Construção e Manutenção de Estações e Redes de Distribuição de Energia Elétrica"},"SG","Construção e Manutenção de Estações e Redes de Distribuição de Energia Elétrica-SG",null,2.5000000000000001E-3,5.1000000000000004E-3,5.6000000000000008E-3,null,{"$f":"IF($I$11=$A$59,\"Margem bruta da empresa de consultoria\",\"Lucro\")","v":"Lucro"},null,null,null,{"$f":"IF($I$11=$A$59,\"K3\",\"L\")","v":"L"},6.1600000000000002E-2,"-",{"$f":"VLOOKUP(CONCATENATE(I$11,\"-\",M22),$C$2:$G$49,3,FALSE)","v":6.1600000000000002E-2},{"$f":"VLOOKUP(CONCATENATE(I$11,\"-\",M22),$C$2:$G$49,4,FALSE)","v":7.400000000000001E-2},{"$f":"VLOOKUP(CONCATENATE(I$11,\"-\",M22),$C$2:$G$49,5,FALSE)","v":8.9600000000000013E-2}]
[{"$f":"A22","v":"Construção e Manutenção de Estações e Redes de Distribuição de Energia Elétrica"},"R","Construção e Manutenção de Estações e Redes de Distribuição de Energia Elétrica-R",null,0.01,1.4800000000000001E-2,1.9699999999999999E-2,null,"Tributos (impostos COFINS 3%, e  PIS 0,65%)",null,null,null,"CP",3.6499999999999998E-2,"-",3.6499999999999998E-2,3.6499999999999998E-2,3.6499999999999998E-2]
[{"$f":"A23","v":"Construção e Manutenção de Estações e Redes de Distribuição de Energia Elétrica"},"DF","Construção e Manutenção de Estações e Redes de Distribuição de Energia Elétrica-DF",null,1.01E-2,1.0700000000000001E-2,1.11E-2,null,"Tributos (ISS, variável de acordo com o município)",null,null,null,"ISS",{"$f":"IF($I$11<>$A$58,Q14*Q13,0)","v":0.02},"-",0,2.5000000000000001E-2,0.05]
[{"$f":"A24","v":"Construção e Manutenção de Estações e Redes de Distribuição de Energia Elétrica"},"L","Construção e Manutenção de Estações e Redes de Distribuição de Energia Elétrica-L",null,0.08,8.3100000000000007E-2,9.5100000000000004E-2,null,"Tributos (Contribuição Previdenciária sobre a Receita Bruta - 0% ou 4,5% - Desoneração)",null,null,null,"CPRB",{"$f":"IF(AND($I$11<>$A$58,Q11=\"Sim\"),4.5%,0%)","v":4.4999999999999998E-2},{"$f":"IF(AND(N25>=P25, N25<=R25), \"OK\", \"Não OK\")","v":"OK"},0,4.4999999999999998E-2,4.4999999999999998E-2]
[{"$f":"A25","v":"Construção e Manutenção de Estações e Redes de Distribuição de Energia Elétrica"},"BDI PAD","Construção e Manutenção de Estações e Redes de Distribuição de Energia Elétrica-BDI PAD",null,0.24,0.25840000000000002,0.27860000000000001,null,"BDI SEM desoneração\n(Fórmula Acórdão TCU)",null,null,null,"BDI PAD",{"$f":"IF($I$11=$A$58,0,ROUND((((1+N18+N19+N20)*(1+N21)*(1+N22)/(1-(N23+N24)))-1),4))","v":0.2036},{"$f":"IF(OR($I$11=$A$59,$I$11=$A$58,AND(N26>=P26, N26<=R26)), \"OK\", \"FORA DO INTERVALO\")","v":"OK"},{"$f":"IF($I$11=$A$58,0,VLOOKUP(CONCATENATE($I$11,\"-\",$M26),$C$2:$G$49,3,FALSE))","v":0.2034},{"$f":"IF($I$11=$A$58,0,VLOOKUP(CONCATENATE($I$11,\"-\",$M26),$C$2:$G$49,4,FALSE))","v":0.22120000000000001},{"$f":"IF($I$11=$A$58,0,VLOOKUP(CONCATENATE($I$11,\"-\",$M26),$C$2:$G$49,5,FALSE))","v":0.25}]
["Obras Portuárias, Marítimas e Fluviais","AC","Obras Portuárias, Marítimas e Fluviais-AC",null,0.04,5.5199999999999999E-2,7.85E-2,null,"BDI COM desoneração",null,null,null,"BDI DES",{"$f":"IF($I$11=$A$58,0,ROUND((((1+N18+N19+N20)*(1+N21)*(1+N22)/(1-(N23+N24+N25)))-1),4))","v":0.26390000000000002},{"$f":"IF(Q11<>\"Sim\",\"\",O26)","v":"OK"},null,null,null,null,null,null,{"$f":"AND(COUNTA(N18:N23)=6,O26<>\"ok\",NOT(V29))","v":false},"pedir anexo"]
[{"$f":"A27","v":"Obras Portuárias, Marítimas e Fluviais"},"SG","Obras Portuárias, Marítimas e Fluviais-SG",null,8.1000000000000013E-3,1.2199999999999999E-2,1.9900000000000001E-2]
[{"$f":"A28","v":"Obras Portuárias, Marítimas e Fluviais"},"R","Obras Portuárias, Marítimas e Fluviais-R",null,1.46E-2,2.3199999999999998E-2,3.1600000000000003E-2,null,{"$f":"IF(V29,\"X\",\"\")","v":""},"Anexo: Relatório Técnico Circunstanciado justificando a adoção do percentual de cada parcela do BDI.",null,null,null,null,null,null,null,null,null,null,null,false,"anexo apresentado"]
[]
[null,null,null,null,null,null,null,null,"Os valores de BDI foram calculados com o emprego da fórmula:"]
[{"$f":"A29","v":"Obras Portuárias, Marítimas e Fluviais"},"DF","Obras Portuárias, Marítimas e Fluviais-DF",null,9.3999999999999986E-3,1.0200000000000001E-2,1.3300000000000001E-2,null,null,null,null,{"$f":"IF(Q11=\"Sim\",\"BDI.DES =\",\"BDI.PAD =\")","v":"BDI.DES ="},{"$f":"IF($I$11=$A$59,\"(1+K1+K2)*(1+K3)\",\"(1+AC + S + R + G)*(1 + DF)*(1+L)\")","v":"(1+AC + S + R + G)*(1 + DF)*(1+L)"},null,null," - 1"]
[{"$f":"A32","v":"Obras Portuárias, Marítimas e Fluviais"},"L","Obras Portuárias, Marítimas e Fluviais-L",null,7.1399999999999991E-2,8.4000000000000005E-2,0.1043,null,null,null,null,null,{"$f":"IF(Q11=\"Sim\",\"(1-CP-ISS-CRPB)\",\"(1-CP-ISS)\")","v":"(1-CP-ISS-CRPB)"}]
[{"$f":"A33","v":"Obras Portuárias, Marítimas e Fluviais"},"BDI PAD","Obras Portuárias, Marítimas e Fluviais-BDI PAD",null,0.22800000000000001,0.27479999999999999,0.3095]
[null,null,null,null,null,null,null,null,{"$f":"CONCATENATE(\"Declaro para os devidos fins que, conforme legislação tributária municipal, a base de cálculo para \",I11,\", é de \",Q13*100,\"%, com a respectiva alíquota de \",Q14*100,\"%.\")","v":"Declaro para os devidos fins que, conforme legislação tributária municipal, a base de cálculo para Construção e Reforma de Edifícios, é de 100%, com a respectiva alíquota de 2%."}]
[]
[null,null,null,null,null,null,null,null,{"$f":"CONCATENATE(\"Declaro para os devidos fins que o regime de Contribuição Previdenciária sobre a Receita Bruta adotado para elaboração do orçamento foi \",IF(Q11=\"Sim\",\"COM\",\"SEM\"),\" Desoneração, e que esta é a alternativa mais adequada para a Administração Pública.\")","v":"Declaro para os devidos fins que o regime de Contribuição Previdenciária sobre a Receita Bruta adotado para elaboração do orçamento foi COM Desoneração, e que esta é a alternativa mais adequada para a Administração Pública."}]
["Fornecimento de Materiais e Equipamentos (aquisição indireta - em conjunto com licitação de obras)","AC","Fornecimento de Materiais e Equipamentos (aquisição indireta - em conjunto com licitação de obras)-AC",null,1.4999999999999999E-2,3.4500000000000003E-2,4.4900000000000002E-2]
[{"$f":"A38","v":"Fornecimento de Materiais e Equipamentos (aquisição indireta - em conjunto com licitação de obras)"},"SG","Fornecimento de Materiais e Equipamentos (aquisição indireta - em conjunto com licitação de obras)-SG",null,3.0000000000000001E-3,4.7999999999999996E-3,8.199999999999999E-3,null,"Observações:"]
[{"$f":"A39","v":"Fornecimento de Materiais e Equipamentos (aquisição indireta - em conjunto com licitação de obras)"},"R","Fornecimento de Materiais e Equipamentos (aquisição indireta - em conjunto com licitação de obras)-R",null,5.6000000000000008E-3,8.5000000000000006E-3,8.8999999999999999E-3]
[{"$f":"A40","v":"Fornecimento de Materiais e Equipamentos (aquisição indireta - em conjunto com licitação de obras)"},"DF","Fornecimento de Materiais e Equipamentos (aquisição indireta - em conjunto com licitação de obras)-DF",null,8.5000000000000006E-3,8.5000000000000006E-3,1.11E-2]
[{"$f":"A41","v":"Fornecimento de Materiais e Equipamentos (aquisição indireta - em conjunto com licitação de obras)"},"L","Fornecimento de Materiais e Equipamentos (aquisição indireta - em conjunto com licitação de obras)-L",null,3.5000000000000003E-2,5.1100000000000007E-2,6.2199999999999998E-2,null,{"$f":"PO!K377","v":"CASEIROS/RS"},null,null,null,null,null,{"$f":"PO!K380","v":"2018-10-30"}]
[{"$f":"A42","v":"Fornecimento de Materiais e Equipamentos (aquisição indireta - em conjunto com licitação de obras)"},"BDI PAD","Fornecimento de Materiais e Equipamentos (aquisição indireta - em conjunto com licitação de obras)-BDI PAD",null,0.111,0.14019999999999999,0.16800000000000001,null,"Local",null,null,null,null,null,"Data"]
["Estudos e Projetos, Planos e Gerenciamento e outros correlatos","K1","Estudos e Projetos, Planos e Gerenciamento e outros correlatos-K1",null,"-","-","-"]
[{"$f":"A44","v":"Estudos e Projetos, Planos e Gerenciamento e outros correlatos"},"K2","Estudos e Projetos, Planos e Gerenciamento e outros correlatos-K2",null,"-",0.2,"-"]
[{"$f":"A45","v":"Estudos e Projetos, Planos e Gerenciamento e outros correlatos"},"","Estudos e Projetos, Planos e Gerenciamento e outros correlatos-",null,"-","-","-",null,"Responsável Técnico",null,null,null,null,null,"Responsável Tomador"]
[{"$f":"A46","v":"Estudos e Projetos, Planos e Gerenciamento e outros correlatos"},"","Estudos e Projetos, Planos e Gerenciamento e outros correlatos-",null,"-","-","-",null,"Nome:",{"$f":"DADOS!B54","v":0},null,null,null,null,"Nome:","LEO CESAR TESSARO"]
[{"$f":"A47","v":"Estudos e Projetos, Planos e Gerenciamento e outros correlatos"},"K3","Estudos e Projetos, Planos e Gerenciamento e outros correlatos-K3",null,"-",0.12,"-",null,"Título:",{"$f":"DADOS!B55","v":0},null,null,null,null,"Cargo:","PREFEITO MUNICIPAL"]
[{"$f":"A48","v":"Estudos e Projetos, Planos e Gerenciamento e outros correlatos"},"BDI PAD","Estudos e Projetos, Planos e Gerenciamento e outros correlatos-BDI PAD",null,"-","-","-",null,{"$f":"DADOS!A56","v":"Empresa:"},{"$f":"DADOS!B56","v":0}]
[null,null,null,null,null,null,null,null,{"$f":"DADOS!A57","v":"CNPJ:"},{"$f":"DADOS!B57","v":0}]
[]
["Construção e Reforma de Edifícios"]
["Construção de Praças Urbanas, Rodovias, Ferrovias e recapeamento e pavimentação de vias urbanas"]
["Construção de Redes de Abastecimento de Água, Coleta de Esgoto"]
["Construção e Manutenção de Estações e Redes de Distribuição de Energia Elétrica"]
["Obras Portuárias, Marítimas e Fluviais"]
["Fornecimento de Materiais e Equipamentos (aquisição indireta - em conjunto com licitação de obras)"]
["Fornecimento de Materiais e Equipamentos (aquisição direta)"]
["Estudos e Projetos, Planos e Gerenciamento e outros correlatos"]

{"sheet":"PO","index":2,"n_rows":381,"n_cols":26,"rows_kept":381,"cut":false,"hidden":false,"merged":[[1,22,1,23],[373,10,373,19],[369,10,371,19],[366,12,366,19],[379,10,379,12],[376,10,376,12]]}
[null,null,null,null,null,null,null,null,null,null,null,null,null,"PO - PLANILHA ORÇAMENTÁRIA",null,null,null,null,null,"Grau de Sigilo"]
[null,"LOTE","Meta","Nível 2","Nível 3","Nível 4","Serviço",null,null,null,null,null,null,{"$f":"CHOOSE(1+LOG(1+2*(TipoOrçamento=\"BASE\")+4*(TipoOrçamento=\"LICITADO\")+8*(TipoOrçamento=\"REPROGRAMADOAC\")+16*(TipoOrçamento=\"REPROGRAMADONPL\"),2),\"nada\",\"Orçamento Base para Licitação\",\"Orçamento Licitado\",\"Orçamento Licitado Reprogramado\",\"Orçamento Base para Licitação - Reprogramado\")","v":"Orçamento Licitado"},null,null,null,null,null,"#PUBLICO",null,null,"Arredondamento"]
[null,null,null,null,null,null,null,null,null,null,null,null,null,null,null,null,null,null,null,null,null,null,"Quantidade",true]
["Nmax",null,null,null,null,null,null,null,null,null,null,null,null,null,null,null,null,null,null,null,"ERRO GERAL",null,"Custo Unitáro",true]
[{"$f":"MAX($A$12:$A$366)","v":2},null,null,null,null,null,null,null,null,null,null,null,null,null,null,null,null,null,null,null,{"$f":"IF(COUNTIF($U$12:OFFSET($U$366,-1,0),\"DESCRIÇÃO\")+COUNTIF($U$12:OFFSET($U$366,-1,0),\"UNIDADE\")+COUNTIF($U$12:OFFSET($U$366,-1,0),\"SEM VALOR\")>0,\"NÃO OK\",\"OK\")","v":"NÃO OK"},"","BDI",true]
[null,null,null,null,null,null,null,null,null,null,null,null,null,null,null,null,null,null,null,null,null,null,"Preço Unitário",true]
[null,null,null,null,null,null,null,null,null,null,null,null,null,null,null,null,null,null,null,null,null,null,"Preço Total",true]
[]
[null,null,null,null,null,null,null,null,null,null,null,null,null,null,null,{"$f":"OFFSET(PLQ!$E$12,ROW($P9)-ROW(P$12),0)","v":"-"}]
["Nível","Altura","n1","n2","n3","n4","n5","Czero","Cnível","Nível","Item","Fonte","Código","Descrição","Unidade","Quantidade",{"$f":"IF(OR(TipoOrçamento=\"LICITADO\",TipoOrçamento=\"REPROGRAMADOAC\"),\"Preço Unitário (R$)\",\"Custo Unitário (R$)\")","v":"Preço Unitário (R$)"},"BDI\n(%)","Preço Unitário (R$)","Preço Total\n(R$)","Erro de Dados","Lista Crono","Concatenação Fonte-Código","BancoRef",{"$f":"IF(TipoOrçamento=\"LICITADO\",\"Preço Unitário Edital (R$)\",\"Custo Unitário Referência (R$)\")","v":"Preço Unitário Edital (R$)"},{"$f":"IF(TipoOrçamento=\"LICITADO\",\"Valor BDI Edital\",\"Valor BDI\")","v":"Valor BDI Edital"}]
[{"$f":"CHOOSE(1+LOG(1+2*(J11=\"Meta\")+4*(J11=\"Nível 2\")+8*(J11=\"Nível 3\")+16*(J11=\"Nível 4\")+32*(J11=\"Serviço\"),2),0,1,2,3,4,\"S\")","v":"S"},{"$f":"IF(OR(A11=\"S\",A11=0),0,IF(ISERROR(I11),H11,SMALL(H11:I11,1)))","v":0},{"$f":"IF($A11=1,OFFSET(C11,-1,0)+1,OFFSET(C11,-1,0))","v":"n1"},{"$f":"IF($A11=1,0,IF($A11=2,OFFSET(D11,-1,0)+1,OFFSET(D11,-1,0)))","v":"n2"},{"$f":"IF(AND($A11<=2,$A11<>0),0,IF($A11=3,OFFSET(E11,-1,0)+1,OFFSET(E11,-1,0)))","v":"n3"},{"$f":"IF(AND($A11<=3,$A11<>0),0,IF($A11=4,OFFSET(F11,-1,0)+1,OFFSET(F11,-1,0)))","v":"n4"},{"$f":"IF(AND($A11<=4,$A11<>0),0,IF($A11=\"S\",OFFSET(G11,-1,0)+1,OFFSET(G11,-1,0)))","v":{"$error":"#VALUE!"}},{"$f":"IF(OR($A11=\"S\",$A11=0),0,MATCH(0,OFFSET($B11,1,$A11,ROW($A$366)-ROW($A11)),0))","v":0},{"$f":"IF(OR($A11=\"S\",$A11=0),0,MATCH(OFFSET($B11,0,$A11)+1,OFFSET($B11,1,$A11,ROW($A$366)-ROW($A11)),0))","v":0},"Serviço",{"$f":"IF($A11=0,\"-\",CONCATENATE(C11&\".\",IF(AND($A$5>=2,$A11>=2),D11&\".\",\"\"),IF(AND($A$5>=3,$A11>=3),E11&\".\",\"\"),IF(AND($A$5>=4,$A11>=4),F11&\".\",\"\"),IF($A11=\"S\",G11&\".\",\"\")))","v":{"$error":"#VALUE!"}},null,null,{"$f":"IF($A11=\"S\",Referencia.Descricao,\"(digite a descrição aqui)\")","v":""},{"$f":"Referencia.Unidade","v":""},null,null,"BDI 1",{"$f":"IF($A11=\"S\",IF($Q$10=\"Preço Unitário (R$)\",PO.CustoUnitario,ROUND(PO.CustoUnitario*(1+$Z11),15-13*$X$6)),0)","v":0},{"$f":"IF($A11=\"S\",VTOTAL1,IF($A11=0,0,ROUND(SomaAgrup,15-13*$X$7)))","v":0},{"$f":"IF($J11=\"\",\"\",IF($N11=\"\",\"DESCRIÇÃO\",IF(AND($J11=\"Serviço\",$O11=\"\"),\"UNIDADE\",IF($T11<=0,\"SEM VALOR\",IF(AND($Y11<>\"\",$Q11>$Y11),\"ACIMA REF.\",\"\")))))","v":"DESCRIÇÃO"},{"$f":"IF(OR($A11=0,$A11=\"S\",$A11>CFF!$A$9),\"\",MAX(V$12:OFFSET(V11,-1,0))+1)","v":""},{"$f":"IF(AND($J11=\"Serviço\",$M11<>\"\"),IF($L11=\"\",$M11,CONCATENATE($L11,\"-\",$M11)))","v":false},{"$f":"IF(AND(Fonte<>\"\",Código<>\"\"),MATCH(Fonte&\" \"&IF(Fonte=\"sinapi\",SUBSTITUTE(SUBSTITUTE(Código,\"/00\",\"/\"),\"/0\",\"/\"),Código),INDIRECT(\"'[Referência \"&_xlnm.Database&\".xls]Banco'!$a:$a\"),0),\"X\")","v":"X"},{"$f":"IF(Import.Desoneracao=\"sim\",Referencia.Desonerado,Referencia.NaoDesonerado)","v":0},{"$f":"ROUND(IF(ISNUMBER(R11),R11,IF(LEFT(R11,3)=\"BDI\",HLOOKUP(R11,DADOS!$T$37:$X$38,2,FALSE),0)),15-11*$X$5)","v":0.26390000000000002}]
[0,{"$f":"COUNTA(OFFSET(B12,1,0):B$366)","v":353},null,null,null,null,null,null,null,{"$f":"IF(OR(TipoOrçamento=\"LICITADO\",TipoOrçamento=\"REPROGRAMADOAC\"),\"CTEF\",\"LOTE\")","v":"CTEF"},0,null,null,{"$f":"IF(TipoOrçamento=\"LICITADO\",DADOS!O43,DADOS!G38)","v":0},null,null,null,null,null,{"$f":"SUMIF(OFFSET($J12,1,0,ROW(T366)-ROW(T12)-1),\"Serviço\",OFFSET(T12,1,0,ROW(T366)-ROW(T12)-1))","v":0},{"$f":"IF($N12=0,\"DESCRIÇÃO\",\"\")","v":"DESCRIÇÃO"},0]
[{"$f":"CHOOSE(1+LOG(1+2*(J13=\"Meta\")+4*(J13=\"Nível 2\")+8*(J13=\"Nível 3\")+16*(J13=\"Nível 4\")+32*(J13=\"Serviço\"),2),0,1,2,3,4,\"S\")","v":1},{"$f":"IF(OR(A13=\"S\",A13=0),0,IF(ISERROR(I13),H13,SMALL(H13:I13,1)))","v":6},{"$f":"IF($A13=1,OFFSET(C13,-1,0)+1,OFFSET(C13,-1,0))","v":1},{"$f":"IF($A13=1,0,IF($A13=2,OFFSET(D13,-1,0)+1,OFFSET(D13,-1,0)))","v":0},{"$f":"IF(AND($A13<=2,$A13<>0),0,IF($A13=3,OFFSET(E13,-1,0)+1,OFFSET(E13,-1,0)))","v":0},{"$f":"IF(AND($A13<=3,$A13<>0),0,IF($A13=4,OFFSET(F13,-1,0)+1,OFFSET(F13,-1,0)))","v":0},{"$f":"IF(AND($A13<=4,$A13<>0),0,IF($A13=\"S\",OFFSET(G13,-1,0)+1,OFFSET(G13,-1,0)))","v":0},{"$f":"IF(OR($A13=\"S\",$A13=0),0,MATCH(0,OFFSET($B13,1,$A13,ROW($A$366)-ROW($A13)),0))","v":353},{"$f":"IF(OR($A13=\"S\",$A13=0),0,MATCH(OFFSET($B13,0,$A13)+1,OFFSET($B13,1,$A13,ROW($A$366)-ROW($A13)),0))","v":6},"Meta",{"$f":"IF($A13=0,\"-\",CONCATENATE(C13&\".\",IF(AND($A$5>=2,$A13>=2),D13&\".\",\"\"),IF(AND($A$5>=3,$A13>=3),E13&\".\",\"\"),IF(AND($A$5>=4,$A13>=4),F13&\".\",\"\"),IF($A13=\"S\",G13&\".\",\"\")))","v":"1."},null,null,"SERVIÇOS PRELIMINARES","",0,null,"BDI 1",{"$f":"IF($A13=\"S\",IF($Q$10=\"Preço Unitário (R$)\",PO.CustoUnitario,ROUND(PO.CustoUnitario*(1+$Z13),15-13*$X$6)),0)","v":0},{"$f":"IF($A13=\"S\",VTOTAL1,IF($A13=0,0,ROUND(SomaAgrup,15-13*$X$7)))","v":0},{"$f":"IF($J13=\"\",\"\",IF($N13=\"\",\"DESCRIÇÃO\",IF(AND($J13=\"Serviço\",$O13=\"\"),\"UNIDADE\",IF($T13<=0,\"SEM VALOR\",IF(AND($Y13<>\"\",$Q13>$Y13),\"ACIMA REF.\",\"\")))))","v":"SEM VALOR"},{"$f":"IF(OR($A13=0,$A13=\"S\",$A13>CFF!$A$9),\"\",MAX(V$12:OFFSET(V13,-1,0))+1)","v":1},{"$f":"IF(AND($J13=\"Serviço\",$M13<>\"\"),IF($L13=\"\",$M13,CONCATENATE($L13,\"-\",$M13)))","v":false},{"$f":"IF(AND(Fonte<>\"\",Código<>\"\"),MATCH(Fonte&\" \"&IF(Fonte=\"sinapi\",SUBSTITUTE(SUBSTITUTE(Código,\"/00\",\"/\"),\"/0\",\"/\"),Código),INDIRECT(\"'[Referência \"&_xlnm.Database&\".xls]Banco'!$a:$a\"),0),\"X\")","v":"X"},0,{"$f":"ROUND(IF(ISNUMBER(R13),R13,IF(LEFT(R13,3)=\"BDI\",HLOOKUP(R13,DADOS!$T$37:$X$38,2,FALSE),0)),15-11*$X$5)","v":0.26390000000000002}]
["S",0,1,0,0,0,1,0,0,"Serviço","1.0.1.","SINAPI","74209/1","PLACA DE OBRA EM CHAPA DE ACO GALVANIZADO","M2",2.5,null,"BDI 1",0,0,"SEM VALOR",{"$f":"IF(OR($A14=0,$A14=\"S\",$A14>CFF!$A$9),\"\",MAX(V$12:OFFSET(V14,-1,0))+1)","v":""},"SINAPI-74209/1",{"$error":"#REF!"},384.1,{"$f":"ROUND(IF(ISNUMBER(R14),R14,IF(LEFT(R14,3)=\"BDI\",HLOOKUP(R14,DADOS!$T$37:$X$38,2,FALSE),0)),15-11*$X$5)","v":0.26390000000000002}]
["S",0,1,0,0,0,2,0,0,"Serviço","1.0.2.","COMP.","041","ENTRADA DE ENERGIA ELETRICA TRIFASICA, CONFORME PADRÃO GED 13 - RGE - FORNECIMENTO E INSTALAÇÃO","UN",1,null,"BDI 1",0,0,"SEM VALOR",{"$f":"IF(OR($A15=0,$A15=\"S\",$A15>CFF!$A$9),\"\",MAX(V$12:OFFSET(V15,-1,0))+1)","v":""},"COMP.-041",{"$error":"#REF!"},2193.69,{"$f":"ROUND(IF(ISNUMBER(R15),R15,IF(LEFT(R15,3)=\"BDI\",HLOOKUP(R15,DADOS!$T$37:$X$38,2,FALSE),0)),15-11*$X$5)","v":0.26390000000000002}]
["S",0,1,0,0,0,3,0,0,"Serviço","1.0.3.","SINAPI","93584","EXECUÇÃO DE DEPÓSITO EM CANTEIRO DE OBRA EM CHAPA DE MADEIRA COMPENSADA, NÃO INCLUSO MOBILIÁRIO. AF_04/2016","M2",12,null,"BDI 1",0,0,"SEM VALOR",{"$f":"IF(OR($A16=0,$A16=\"S\",$A16>CFF!$A$9),\"\",MAX(V$12:OFFSET(V16,-1,0))+1)","v":""},"SINAPI-93584",{"$error":"#REF!"},645.67999999999995,{"$f":"ROUND(IF(ISNUMBER(R16),R16,IF(LEFT(R16,3)=\"BDI\",HLOOKUP(R16,DADOS!$T$37:$X$38,2,FALSE),0)),15-11*$X$5)","v":0.26390000000000002}]
["S",0,1,0,0,0,4,0,0,"Serviço","1.0.4.","SINAPI","74220/1","TAPUME DE CHAPA DE MADEIRA COMPENSADA, E= 6MM, COM PINTURA A CAL E REAPROVEITAMENTO DE 2X","M2",134.19999999999999,null,"BDI 1",0,0,"SEM VALOR",{"$f":"IF(OR($A17=0,$A17=\"S\",$A17>CFF!$A$9),\"\",MAX(V$12:OFFSET(V17,-1,0))+1)","v":""},"SINAPI-74220/1",{"$error":"#REF!"},55.91,{"$f":"ROUND(IF(ISNUMBER(R17),R17,IF(LEFT(R17,3)=\"BDI\",HLOOKUP(R17,DADOS!$T$37:$X$38,2,FALSE),0)),15-11*$X$5)","v":0.26390000000000002}]
["S",0,1,0,0,0,5,0,0,"Serviço","1.0.5.","SINAPI","74077/2","LOCACAO CONVENCIONAL DE OBRA, ATRAVÉS DE GABARITO DE TABUAS CORRIDAS PONTALETADAS, COM REAPROVEITAMENTO DE 10 VEZES.","M2",200,null,"BDI 1",0,0,"SEM VALOR",{"$f":"IF(OR($A18=0,$A18=\"S\",$A18>CFF!$A$9),\"\",MAX(V$12:OFFSET(V18,-1,0))+1)","v":""},"SINAPI-74077/2",{"$error":"#REF!"},4.74,{"$f":"ROUND(IF(ISNUMBER(R18),R18,IF(LEFT(R18,3)=\"BDI\",HLOOKUP(R18,DADOS!$T$37:$X$38,2,FALSE),0)),15-11*$X$5)","v":0.26390000000000002}]
[1,5,2,0,0,0,0,347,5,"Meta","2.",null,null,"MOVIMENTO DE TERRA","",0,null,"BDI 1",0,0,"SEM VALOR",{"$f":"IF(OR($A19=0,$A19=\"S\",$A19>CFF!$A$9),\"\",MAX(V$12:OFFSET(V19,-1,0))+1)","v":2},false,"X",0,{"$f":"ROUND(IF(ISNUMBER(R19),R19,IF(LEFT(R19,3)=\"BDI\",HLOOKUP(R19,DADOS!$T$37:$X$38,2,FALSE),0)),15-11*$X$5)","v":0.26390000000000002}]
["S",0,2,0,0,0,1,0,0,"Serviço","2.0.1.","SINAPI","93358","ESCAVAÇÃO MANUAL DE VALA COM PROFUNDIDADE MENOR OU IGUAL A 1,30 M. AF_03/2016","M3",15,null,"BDI 1",0,0,"SEM VALOR",{"$f":"IF(OR($A20=0,$A20=\"S\",$A20>CFF!$A$9),\"\",MAX(V$12:OFFSET(V20,-1,0))+1)","v":""},"SINAPI-93358",{"$error":"#REF!"},70.59,{"$f":"ROUND(IF(ISNUMBER(R20),R20,IF(LEFT(R20,3)=\"BDI\",HLOOKUP(R20,DADOS!$T$37:$X$38,2,FALSE),0)),15-11*$X$5)","v":0.26390000000000002}]
["S",0,2,0,0,0,2,0,0,"Serviço","2.0.2.","SINAPI","94097","PREPARO DE FUNDO DE VALA COM LARGURA MENOR QUE 1,5 M, EM LOCAL COM NÍVEL BAIXO DE INTERFERÊNCIA. AF_06/2016","M2",30,null,"BDI 1",0,0,"SEM VALOR",{"$f":"IF(OR($A21=0,$A21=\"S\",$A21>CFF!$A$9),\"\",MAX(V$12:OFFSET(V21,-1,0))+1)","v":""},"SINAPI-94097",{"$error":"#REF!"},5.18,{"$f":"ROUND(IF(ISNUMBER(R21),R21,IF(LEFT(R21,3)=\"BDI\",HLOOKUP(R21,DADOS!$T$37:$X$38,2,FALSE),0)),15-11*$X$5)","v":0.26390000000000002}]
["S",0,2,0,0,0,3,0,0,"Serviço","2.0.3.","SINAPI","93382","REATERRO MANUAL DE VALAS COM COMPACTAÇÃO MECANIZADA. AF_04/2016","M3",12.91,null,"BDI 1",0,0,"SEM VALOR",{"$f":"IF(OR($A22=0,$A22=\"S\",$A22>CFF!$A$9),\"\",MAX(V$12:OFFSET(V22,-1,0))+1)","v":""},"SINAPI-93382",{"$error":"#REF!"},27.81,{"$f":"ROUND(IF(ISNUMBER(R22),R22,IF(LEFT(R22,3)=\"BDI\",HLOOKUP(R22,DADOS!$T$37:$X$38,2,FALSE),0)),15-11*$X$5)","v":0.26390000000000002}]
["S",0,2,0,0,0,4,0,0,"Serviço","2.0.4.","SINAPI","93382","REATERRO MANUAL DE VALAS COM COMPACTAÇÃO MECANIZADA. AF_04/2016","M3",33.06,null,"BDI 1",0,0,"SEM VALOR",{"$f":"IF(OR($A23=0,$A23=\"S\",$A23>CFF!$A$9),\"\",MAX(V$12:OFFSET(V23,-1,0))+1)","v":""},"SINAPI-93382",{"$error":"#REF!"},27.81,{"$f":"ROUND(IF(ISNUMBER(R23),R23,IF(LEFT(R23,3)=\"BDI\",HLOOKUP(R23,DADOS!$T$37:$X$38,2,FALSE),0)),15-11*$X$5)","v":0.26390000000000002}]
[1,23,3,0,0,0,0,342,23,"Meta","3.",null,null,"INFRA-ESTRUTURA: FUNDAÇÕES","",0,null,"BDI 1",0,0,"SEM VALOR",{"$f":"IF(OR($A24=0,$A24=\"S\",$A24>CFF!$A$9),\"\",MAX(V$12:OFFSET(V24,-1,0))+1)","v":3},false,"X",0,{"$f":"ROUND(IF(ISNUMBER(R24),R24,IF(LEFT(R24,3)=\"BDI\",HLOOKUP(R24,DADOS!$T$37:$X$38,2,FALSE),0)),15-11*$X$5)","v":0.26390000000000002}]
[2,12,3,1,0,0,0,22,12,"Nível 2","3.1.","SINAPI","93358","SAPATAS E \"PESCOÇO\" DOS PILARES","M3",0,null,"BDI 1",0,0,"SEM VALOR",{"$f":"IF(OR($A25=0,$A25=\"S\",$A25>CFF!$A$9),\"\",MAX(V$12:OFFSET(V25,-1,0))+1)","v":4},false,{"$error":"#REF!"},0,{"$f":"ROUND(IF(ISNUMBER(R25),R25,IF(LEFT(R25,3)=\"BDI\",HLOOKUP(R25,DADOS!$T$37:$X$38,2,FALSE),0)),15-11*$X$5)","v":0.26390000000000002}]
["S",0,3,1,0,0,1,0,0,"Serviço","3.1.1.","SINAPI","93358","ESCAVAÇÃO MANUAL DE VALA COM PROFUNDIDADE MENOR OU IGUAL A 1,30 M. AF_03/2016","M3",24.26,null,"BDI 1",0,0,"SEM VALOR",{"$f":"IF(OR($A26=0,$A26=\"S\",$A26>CFF!$A$9),\"\",MAX(V$12:OFFSET(V26,-1,0))+1)","v":""},"SINAPI-93358",{"$error":"#REF!"},70.59,{"$f":"ROUND(IF(ISNUMBER(R26),R26,IF(LEFT(R26,3)=\"BDI\",HLOOKUP(R26,DADOS!$T$37:$X$38,2,FALSE),0)),15-11*$X$5)","v":0.26390000000000002}]
["S",0,3,1,0,0,2,0,0,"Serviço","3.1.2.","SINAPI","94098","PREPARO DE FUNDO DE VALA  COM LARGURA MENOR QUE 1,5 M, EM LOCAL COM NÍVEL ALTO DE INTERFERÊNCIA. AF_06/2016","M2",39.89,null,"BDI 1",0,0,"SEM VALOR",{"$f":"IF(OR($A27=0,$A27=\"S\",$A27>CFF!$A$9),\"\",MAX(V$12:OFFSET(V27,-1,0))+1)","v":""},"SINAPI-94098",{"$error":"#REF!"},5.9,{"$f":"ROUND(IF(ISNUMBER(R27),R27,IF(LEFT(R27,3)=\"BDI\",HLOOKUP(R27,DADOS!$T$37:$X$38,2,FALSE),0)),15-11*$X$5)","v":0.26390000000000002}]
["S",0,3,1,0,0,3,0,0,"Serviço","3.1.3.","SINAPI","96617","LASTRO DE CONCRETO MAGRO, APLICADO EM BLOCOS DE COROAMENTO OU SAPATAS, ESPESSURA DE 3 CM. AF_08/2017","M2",39.89,null,"BDI 1",0,0,"SEM VALOR",{"$f":"IF(OR($A28=0,$A28=\"S\",$A28>CFF!$A$9),\"\",MAX(V$12:OFFSET(V28,-1,0))+1)","v":""},"SINAPI-96617",{"$error":"#REF!"},15.89,{"$f":"ROUND(IF(ISNUMBER(R28),R28,IF(LEFT(R28,3)=\"BDI\",HLOOKUP(R28,DADOS!$T$37:$X$38,2,FALSE),0)),15-11*$X$5)","v":0.26390000000000002}]
["S",0,3,1,0,0,4,0,0,"Serviço","3.1.4.","SINAPI","96535","FABRICAÇÃO, MONTAGEM E DESMONTAGEM DE FÔRMA PARA SAPATA, EM MADEIRA SERRADA, E=25 MM, 4 UTILIZAÇÕES. AF_06/2017","M2",37.659999999999997,null,"BDI 1",0,0,"SEM VALOR",{"$f":"IF(OR($A29=0,$A29=\"S\",$A29>CFF!$A$9),\"\",MAX(V$12:OFFSET(V29,-1,0))+1)","v":""},"SINAPI-96535",{"$error":"#REF!"},109.69,{"$f":"ROUND(IF(ISNUMBER(R29),R29,IF(LEFT(R29,3)=\"BDI\",HLOOKUP(R29,DADOS!$T$37:$X$38,2,FALSE),0)),15-11*$X$5)","v":0.26390000000000002}]
[{"$f":"CHOOSE(1+LOG(1+2*(J30=\"Meta\")+4*(J30=\"Nível 2\")+8*(J30=\"Nível 3\")+16*(J30=\"Nível 4\")+32*(J30=\"Serviço\"),2),0,1,2,3,4,\"S\")","v":"S"},{"$f":"IF(OR(A30=\"S\",A30=0),0,IF(ISERROR(I30),H30,SMALL(H30:I30,1)))","v":0},3,1,0,0,5,0,0,"Serviço",{"$f":"IF($A30=0,\"-\",CONCATENATE(C30&\".\",IF(AND($A$5>=2,$A30>=2),D30&\".\",\"\"),IF(AND($A$5>=3,$A30>=3),E30&\".\",\"\"),IF(AND($A$5>=4,$A30>=4),F30&\".\",\"\"),IF($A30=\"S\",G30&\".\",\"\")))","v":"3.1.5."},"COMP.","015","CONCRETAGEM DE SAPATAS, FCK 25 MPA, COM USO DE BOMBA ? LANÇAMENTO, ADENSAMENTO E ACABAMENTO","M3",13.53,null,"BDI 1",0,0,"SEM VALOR",{"$f":"IF(OR($A30=0,$A30=\"S\",$A30>CFF!$A$9),\"\",MAX(V$12:OFFSET(V30,-1,0))+1)","v":""},"COMP.-015",{"$error":"#REF!"},493.63,{"$f":"ROUND(IF(ISNUMBER(R30),R30,IF(LEFT(R30,3)=\"BDI\",HLOOKUP(R30,DADOS!$T$37:$X$38,2,FALSE),0)),15-11*$X$5)","v":0.26390000000000002}]
["S",0,3,1,0,0,6,0,0,"Serviço","3.1.6.","SINAPI","96543","ARMAÇÃO DE BLOCO, VIGA BALDRAME E SAPATA UTILIZANDO AÇO CA-60 DE 5 MM - MONTAGEM. AF_06/2017","KG",17.100000000000001,null,"BDI 1",0,0,"SEM VALOR",{"$f":"IF(OR($A31=0,$A31=\"S\",$A31>CFF!$A$9),\"\",MAX(V$12:OFFSET(V31,-1,0))+1)","v":""},"SINAPI-96543",{"$error":"#REF!"},13.18,{"$f":"ROUND(IF(ISNUMBER(R31),R31,IF(LEFT(R31,3)=\"BDI\",HLOOKUP(R31,DADOS!$T$37:$X$38,2,FALSE),0)),15-11*$X$5)","v":0.26390000000000002}]
["S",0,3,1,0,0,7,0,0,"Serviço","3.1.7.","SINAPI","96544","ARMAÇÃO DE BLOCO, VIGA BALDRAME OU SAPATA UTILIZANDO AÇO CA-50 DE 6,3 MM - MONTAGEM. AF_06/2017","KG",18.18,null,"BDI 1",0,0,"SEM VALOR",{"$f":"IF(OR($A32=0,$A32=\"S\",$A32>CFF!$A$9),\"\",MAX(V$12:OFFSET(V32,-1,0))+1)","v":""},"SINAPI-96544",{"$error":"#REF!"},11.43,{"$f":"ROUND(IF(ISNUMBER(R32),R32,IF(LEFT(R32,3)=\"BDI\",HLOOKUP(R32,DADOS!$T$37:$X$38,2,FALSE),0)),15-11*$X$5)","v":0.26390000000000002}]
["S",0,3,1,0,0,8,0,0,"Serviço","3.1.8.","SINAPI","96545","ARMAÇÃO DE BLOCO, VIGA BALDRAME OU SAPATA UTILIZANDO AÇO CA-50 DE 8 MM - MONTAGEM. AF_06/2017","KG",121.23,null,"BDI 1",0,0,"SEM VALOR",{"$f":"IF(OR($A33=0,$A33=\"S\",$A33>CFF!$A$9),\"\",MAX(V$12:OFFSET(V33,-1,0))+1)","v":""},"SINAPI-96545",{"$error":"#REF!"},10.95,{"$f":"ROUND(IF(ISNUMBER(R33),R33,IF(LEFT(R33,3)=\"BDI\",HLOOKUP(R33,DADOS!$T$37:$X$38,2,FALSE),0)),15-11*$X$5)","v":0.26390000000000002}]
["S",0,3,1,0,0,9,0,0,"Serviço","3.1.9.","SINAPI","96546","ARMAÇÃO DE BLOCO, VIGA BALDRAME OU SAPATA UTILIZANDO AÇO CA-50 DE 10 MM - MONTAGEM. AF_06/2017","KG",356.31,null,"BDI 1",0,0,"SEM VALOR",{"$f":"IF(OR($A34=0,$A34=\"S\",$A34>CFF!$A$9),\"\",MAX(V$12:OFFSET(V34,-1,0))+1)","v":""},"SINAPI-96546",{"$error":"#REF!"},8.9499999999999993,{"$f":"ROUND(IF(ISNUMBER(R34),R34,IF(LEFT(R34,3)=\"BDI\",HLOOKUP(R34,DADOS!$T$37:$X$38,2,FALSE),0)),15-11*$X$5)","v":0.26390000000000002}]
["S",0,3,1,0,0,10,0,0,"Serviço","3.1.10.","SINAPI","96547","ARMAÇÃO DE BLOCO, VIGA BALDRAME OU SAPATA UTILIZANDO AÇO CA-50 DE 12,5 MM - MONTAGEM. AF_06/2017","KG",138.78,null,"BDI 1",0,0,"SEM VALOR",{"$f":"IF(OR($A35=0,$A35=\"S\",$A35>CFF!$A$9),\"\",MAX(V$12:OFFSET(V35,-1,0))+1)","v":""},"SINAPI-96547",{"$error":"#REF!"},7.94,{"$f":"ROUND(IF(ISNUMBER(R35),R35,IF(LEFT(R35,3)=\"BDI\",HLOOKUP(R35,DADOS!$T$37:$X$38,2,FALSE),0)),15-11*$X$5)","v":0.26390000000000002}]
["S",0,3,1,0,0,11,0,0,"Serviço","3.1.11.","SINAPI","93382","REATERRO MANUAL DE VALAS COM COMPACTAÇÃO MECANIZADA. AF_04/2016","M3",10.73,null,"BDI 1",0,0,"SEM VALOR",{"$f":"IF(OR($A36=0,$A36=\"S\",$A36>CFF!$A$9),\"\",MAX(V$12:OFFSET(V36,-1,0))+1)","v":""},"SINAPI-93382",{"$error":"#REF!"},27.81,{"$f":"ROUND(IF(ISNUMBER(R36),R36,IF(LEFT(R36,3)=\"BDI\",HLOOKUP(R36,DADOS!$T$37:$X$38,2,FALSE),0)),15-11*$X$5)","v":0.26390000000000002}]
[2,10,3,2,0,0,0,10,25,"Nível 2","3.2.",null,null,"VIGAS BALDRAME","",0,null,"BDI 1",0,0,"SEM VALOR",{"$f":"IF(OR($A37=0,$A37=\"S\",$A37>CFF!$A$9),\"\",MAX(V$12:OFFSET(V37,-1,0))+1)","v":5},false,"X",0,{"$f":"ROUND(IF(ISNUMBER(R37),R37,IF(LEFT(R37,3)=\"BDI\",HLOOKUP(R37,DADOS!$T$37:$X$38,2,FALSE),0)),15-11*$X$5)","v":0.26390000000000002}]
["S",0,3,2,0,0,1,0,0,"Serviço","3.2.1.","SINAPI","93358","ESCAVAÇÃO MANUAL DE VALA COM PROFUNDIDADE MENOR OU IGUAL A 1,30 M. AF_03/2016","M3",16.739999999999998,null,"BDI 1",0,0,"SEM VALOR",{"$f":"IF(OR($A38=0,$A38=\"S\",$A38>CFF!$A$9),\"\",MAX(V$12:OFFSET(V38,-1,0))+1)","v":""},"SINAPI-93358",{"$error":"#REF!"},70.59,{"$f":"ROUND(IF(ISNUMBER(R38),R38,IF(LEFT(R38,3)=\"BDI\",HLOOKUP(R38,DADOS!$T$37:$X$38,2,FALSE),0)),15-11*$X$5)","v":0.26390000000000002}]
["S",0,3,2,0,0,2,0,0,"Serviço","3.2.2.","SINAPI","94098","PREPARO DE FUNDO DE VALA  COM LARGURA MENOR QUE 1,5 M, EM LOCAL COM NÍVEL ALTO DE INTERFERÊNCIA. AF_06/2016","M2",25.75,null,"BDI 1",0,0,"SEM VALOR",{"$f":"IF(OR($A39=0,$A39=\"S\",$A39>CFF!$A$9),\"\",MAX(V$12:OFFSET(V39,-1,0))+1)","v":""},"SINAPI-94098",{"$error":"#REF!"},5.9,{"$f":"ROUND(IF(ISNUMBER(R39),R39,IF(LEFT(R39,3)=\"BDI\",HLOOKUP(R39,DADOS!$T$37:$X$38,2,FALSE),0)),15-11*$X$5)","v":0.26390000000000002}]
["S",0,3,2,0,0,3,0,0,"Serviço","3.2.3.","SINAPI","96617","LASTRO DE CONCRETO MAGRO, APLICADO EM BLOCOS DE COROAMENTO OU SAPATAS, ESPESSURA DE 3 CM. AF_08/2017","M2",25.75,null,"BDI 1",0,0,"SEM VALOR",{"$f":"IF(OR($A40=0,$A40=\"S\",$A40>CFF!$A$9),\"\",MAX(V$12:OFFSET(V40,-1,0))+1)","v":""},"SINAPI-96617",{"$error":"#REF!"},15.89,{"$f":"ROUND(IF(ISNUMBER(R40),R40,IF(LEFT(R40,3)=\"BDI\",HLOOKUP(R40,DADOS!$T$37:$X$38,2,FALSE),0)),15-11*$X$5)","v":0.26390000000000002}]
["S",0,3,2,0,0,4,0,0,"Serviço","3.2.4.","SINAPI","96536","FABRICAÇÃO, MONTAGEM E DESMONTAGEM DE FÔRMA PARA VIGA BALDRAME, EM MADEIRA SERRADA, E=25 MM, 4 UTILIZAÇÕES. AF_06/2017","M2",77.25,null,"BDI 1",0,0,"SEM VALOR",{"$f":"IF(OR($A41=0,$A41=\"S\",$A41>CFF!$A$9),\"\",MAX(V$12:OFFSET(V41,-1,0))+1)","v":""},"SINAPI-96536",{"$error":"#REF!"},54.37,{"$f":"ROUND(IF(ISNUMBER(R41),R41,IF(LEFT(R41,3)=\"BDI\",HLOOKUP(R41,DADOS!$T$37:$X$38,2,FALSE),0)),15-11*$X$5)","v":0.26390000000000002}]
["S",0,3,2,0,0,5,0,0,"Serviço","3.2.5.","COMP.","016","CONCRETAGEM DE BLOCOS DE VIGAS BALDRAMES, FCK 25 MPA, COM USO DE BOMBA ? LANÇAMENTO, ADENSAMENTO E ACABAMENTO","M3",7.73,null,"BDI 1",0,0,"SEM VALOR",{"$f":"IF(OR($A42=0,$A42=\"S\",$A42>CFF!$A$9),\"\",MAX(V$12:OFFSET(V42,-1,0))+1)","v":""},"COMP.-016",{"$error":"#REF!"},487.27,{"$f":"ROUND(IF(ISNUMBER(R42),R42,IF(LEFT(R42,3)=\"BDI\",HLOOKUP(R42,DADOS!$T$37:$X$38,2,FALSE),0)),15-11*$X$5)","v":0.26390000000000002}]
["S",0,3,2,0,0,6,0,0,"Serviço","3.2.6.","SINAPI","96543","ARMAÇÃO DE BLOCO, VIGA BALDRAME E SAPATA UTILIZANDO AÇO CA-60 DE 5 MM - MONTAGEM. AF_06/2017","KG",116.28,null,"BDI 1",0,0,"SEM VALOR",{"$f":"IF(OR($A43=0,$A43=\"S\",$A43>CFF!$A$9),\"\",MAX(V$12:OFFSET(V43,-1,0))+1)","v":""},"SINAPI-96543",{"$error":"#REF!"},13.18,{"$f":"ROUND(IF(ISNUMBER(R43),R43,IF(LEFT(R43,3)=\"BDI\",HLOOKUP(R43,DADOS!$T$37:$X$38,2,FALSE),0)),15-11*$X$5)","v":0.26390000000000002}]
["S",0,3,2,0,0,7,0,0,"Serviço","3.2.7.","SINAPI","96545","ARMAÇÃO DE BLOCO, VIGA BALDRAME OU SAPATA UTILIZANDO AÇO CA-50 DE 8 MM - MONTAGEM. AF_06/2017","KG",201.87,null,"BDI 1",0,0,"SEM VALOR",{"$f":"IF(OR($A44=0,$A44=\"S\",$A44>CFF!$A$9),\"\",MAX(V$12:OFFSET(V44,-1,0))+1)","v":""},"SINAPI-96545",{"$error":"#REF!"},10.95,{"$f":"ROUND(IF(ISNUMBER(R44),R44,IF(LEFT(R44,3)=\"BDI\",HLOOKUP(R44,DADOS!$T$37:$X$38,2,FALSE),0)),15-11*$X$5)","v":0.26390000000000002}]
["S",0,3,2,0,0,8,0,0,"Serviço","3.2.8.","SINAPI","96546","ARMAÇÃO DE BLOCO, VIGA BALDRAME OU SAPATA UTILIZANDO AÇO CA-50 DE 10 MM - MONTAGEM. AF_06/2017","KG",20.61,null,"BDI 1",0,0,"SEM VALOR",{"$f":"IF(OR($A45=0,$A45=\"S\",$A45>CFF!$A$9),\"\",MAX(V$12:OFFSET(V45,-1,0))+1)","v":""},"SINAPI-96546",{"$error":"#REF!"},8.9499999999999993,{"$f":"ROUND(IF(ISNUMBER(R45),R45,IF(LEFT(R45,3)=\"BDI\",HLOOKUP(R45,DADOS!$T$37:$X$38,2,FALSE),0)),15-11*$X$5)","v":0.26390000000000002}]
["S",0,3,2,0,0,9,0,0,"Serviço","3.2.9.","SINAPI","93382","REATERRO MANUAL DE VALAS COM COMPACTAÇÃO MECANIZADA. AF_04/2016","M3",9.01,null,"BDI 1",0,0,"SEM VALOR",{"$f":"IF(OR($A46=0,$A46=\"S\",$A46>CFF!$A$9),\"\",MAX(V$12:OFFSET(V46,-1,0))+1)","v":""},"SINAPI-93382",{"$error":"#REF!"},27.81,{"$f":"ROUND(IF(ISNUMBER(R46),R46,IF(LEFT(R46,3)=\"BDI\",HLOOKUP(R46,DADOS!$T$37:$X$38,2,FALSE),0)),15-11*$X$5)","v":0.26390000000000002}]
[1,48,4,0,0,0,0,319,48,"Meta","4.",null,null,"SUPERESTRUTURA","",0,null,"BDI 1",0,0,"SEM VALOR",{"$f":"IF(OR($A47=0,$A47=\"S\",$A47>CFF!$A$9),\"\",MAX(V$12:OFFSET(V47,-1,0))+1)","v":6},false,"X",0,{"$f":"ROUND(IF(ISNUMBER(R47),R47,IF(LEFT(R47,3)=\"BDI\",HLOOKUP(R47,DADOS!$T$37:$X$38,2,FALSE),0)),15-11*$X$5)","v":0.26390000000000002}]
[2,6,4,1,0,0,0,47,6,"Nível 2","4.1.",null,null,"PILARES - TÉRREO","",0,null,"BDI 1",0,0,"SEM VALOR",{"$f":"IF(OR($A48=0,$A48=\"S\",$A48>CFF!$A$9),\"\",MAX(V$12:OFFSET(V48,-1,0))+1)","v":7},false,"X",0,{"$f":"ROUND(IF(ISNUMBER(R48),R48,IF(LEFT(R48,3)=\"BDI\",HLOOKUP(R48,DADOS!$T$37:$X$38,2,FALSE),0)),15-11*$X$5)","v":0.26390000000000002}]
["S",0,4,1,0,0,1,0,0,"Serviço","4.1.1.","SINAPI","92434","MONTAGEM E DESMONTAGEM DE FÔRMA DE PILARES RETANGULARES E ESTRUTURAS SIMILARES COM ÁREA MÉDIA DAS SEÇÕES MENOR OU IGUAL A 0,25 M², PÉ-DIREITO SIMPLES, EM CHAPA DE MADEIRA COMPENSADA PLASTIFICADA, 12 UTILIZAÇÕES. AF_12/2015","M2",39.75,null,"BDI 1",0,0,"SEM VALOR",{"$f":"IF(OR($A49=0,$A49=\"S\",$A49>CFF!$A$9),\"\",MAX(V$12:OFFSET(V49,-1,0))+1)","v":""},"SINAPI-92434",{"$error":"#REF!"},48.13,{"$f":"ROUND(IF(ISNUMBER(R49),R49,IF(LEFT(R49,3)=\"BDI\",HLOOKUP(R49,DADOS!$T$37:$X$38,2,FALSE),0)),15-11*$X$5)","v":0.26390000000000002}]
["S",0,4,1,0,0,2,0,0,"Serviço","4.1.2.","SINAPI","92720","CONCRETAGEM DE PILARES, FCK = 25 MPA, COM USO DE BOMBA EM EDIFICAÇÃO COM SEÇÃO MÉDIA DE PILARES MENOR OU IGUAL A 0,25 M² - LANÇAMENTO, ADENSAMENTO E ACABAMENTO. AF_12/2015","M3",2.58,null,"BDI 1",0,0,"SEM VALOR",{"$f":"IF(OR($A50=0,$A50=\"S\",$A50>CFF!$A$9),\"\",MAX(V$12:OFFSET(V50,-1,0))+1)","v":""},"SINAPI-92720",{"$error":"#REF!"},480.32,{"$f":"ROUND(IF(ISNUMBER(R50),R50,IF(LEFT(R50,3)=\"BDI\",HLOOKUP(R50,DADOS!$T$37:$X$38,2,FALSE),0)),15-11*$X$5)","v":0.26390000000000002}]
["S",0,4,1,0,0,3,0,0,"Serviço","4.1.3.","SINAPI","92775","ARMAÇÃO DE PILAR OU VIGA DE UMA ESTRUTURA CONVENCIONAL DE CONCRETO ARMADO EM UMA EDIFICAÇÃO TÉRREA OU SOBRADO UTILIZANDO AÇO CA-60 DE 5,0 MM - MONTAGEM. AF_12/2015","KG",75.959999999999994,null,"BDI 1",0,0,"SEM VALOR",{"$f":"IF(OR($A51=0,$A51=\"S\",$A51>CFF!$A$9),\"\",MAX(V$12:OFFSET(V51,-1,0))+1)","v":""},"SINAPI-92775",{"$error":"#REF!"},13.31,{"$f":"ROUND(IF(ISNUMBER(R51),R51,IF(LEFT(R51,3)=\"BDI\",HLOOKUP(R51,DADOS!$T$37:$X$38,2,FALSE),0)),15-11*$X$5)","v":0.26390000000000002}]
["S",0,4,1,0,0,4,0,0,"Serviço","4.1.4.","SINAPI","92778","ARMAÇÃO DE PILAR OU VIGA DE UMA ESTRUTURA CONVENCIONAL DE CONCRETO ARMADO EM UMA EDIFICAÇÃO TÉRREA OU SOBRADO UTILIZANDO AÇO CA-50 DE 10,0 MM - MONTAGEM. AF_12/2015","KG",225.36,null,"BDI 1",0,0,"SEM VALOR",{"$f":"IF(OR($A52=0,$A52=\"S\",$A52>CFF!$A$9),\"\",MAX(V$12:OFFSET(V52,-1,0))+1)","v":""},"SINAPI-92778",{"$error":"#REF!"},8.8699999999999992,{"$f":"ROUND(IF(ISNUMBER(R52),R52,IF(LEFT(R52,3)=\"BDI\",HLOOKUP(R52,DADOS!$T$37:$X$38,2,FALSE),0)),15-11*$X$5)","v":0.26390000000000002}]
["S",0,4,1,0,0,5,0,0,"Serviço","4.1.5.","SINAPI","92779","ARMAÇÃO DE PILAR OU VIGA DE UMA ESTRUTURA CONVENCIONAL DE CONCRETO ARMADO EM UMA EDIFICAÇÃO TÉRREA OU SOBRADO UTILIZANDO AÇO CA-50 DE 12,5 MM - MONTAGEM. AF_12/2015","KG",18.63,null,"BDI 1",0,0,"SEM VALOR",{"$f":"IF(OR($A53=0,$A53=\"S\",$A53>CFF!$A$9),\"\",MAX(V$12:OFFSET(V53,-1,0))+1)","v":""},"SINAPI-92779",{"$error":"#REF!"},7.81,{"$f":"ROUND(IF(ISNUMBER(R53),R53,IF(LEFT(R53,3)=\"BDI\",HLOOKUP(R53,DADOS!$T$37:$X$38,2,FALSE),0)),15-11*$X$5)","v":0.26390000000000002}]
[2,8,4,2,0,0,0,41,8,"Nível 2","4.2.","SINAPI",null,"VIGAS TÉRREO","",0,null,"BDI 1",0,0,"SEM VALOR",{"$f":"IF(OR($A54=0,$A54=\"S\",$A54>CFF!$A$9),\"\",MAX(V$12:OFFSET(V54,-1,0))+1)","v":8},false,"X",0,{"$f":"ROUND(IF(ISNUMBER(R54),R54,IF(LEFT(R54,3)=\"BDI\",HLOOKUP(R54,DADOS!$T$37:$X$38,2,FALSE),0)),15-11*$X$5)","v":0.26390000000000002}]
["S",0,4,2,0,0,1,0,0,"Serviço","4.2.1.","SINAPI","92479","MONTAGEM E DESMONTAGEM DE FÔRMA DE VIGA, ESCORAMENTO COM GARFO DE MADEIRA, PÉ-DIREITO SIMPLES, EM CHAPA DE MADEIRA PLASTIFICADA, 18 UTILIZAÇÕES. AF_12/2015","M2",94.03,null,"BDI 1",0,0,"SEM VALOR",{"$f":"IF(OR($A55=0,$A55=\"S\",$A55>CFF!$A$9),\"\",MAX(V$12:OFFSET(V55,-1,0))+1)","v":""},"SINAPI-92479",{"$error":"#REF!"},42,{"$f":"ROUND(IF(ISNUMBER(R55),R55,IF(LEFT(R55,3)=\"BDI\",HLOOKUP(R55,DADOS!$T$37:$X$38,2,FALSE),0)),15-11*$X$5)","v":0.26390000000000002}]
["S",0,4,2,0,0,2,0,0,"Serviço","4.2.2.","COMP.","017","CONCRETAGEM DE VIGAS E LAJES, FCK=25 MPA - LANÇAMENTO, ADENSAMENTO E ACABAMENTO","M3",6.53,null,"BDI 1",0,0,"SEM VALOR",{"$f":"IF(OR($A56=0,$A56=\"S\",$A56>CFF!$A$9),\"\",MAX(V$12:OFFSET(V56,-1,0))+1)","v":""},"COMP.-017",{"$error":"#REF!"},471.95,{"$f":"ROUND(IF(ISNUMBER(R56),R56,IF(LEFT(R56,3)=\"BDI\",HLOOKUP(R56,DADOS!$T$37:$X$38,2,FALSE),0)),15-11*$X$5)","v":0.26390000000000002}]
["S",0,4,2,0,0,3,0,0,"Serviço","4.2.3.","SINAPI","92775","ARMAÇÃO DE PILAR OU VIGA DE UMA ESTRUTURA CONVENCIONAL DE CONCRETO ARMADO EM UMA EDIFICAÇÃO TÉRREA OU SOBRADO UTILIZANDO AÇO CA-60 DE 5,0 MM - MONTAGEM. AF_12/2015","KG",101.52,null,"BDI 1",0,0,"SEM VALOR",{"$f":"IF(OR($A57=0,$A57=\"S\",$A57>CFF!$A$9),\"\",MAX(V$12:OFFSET(V57,-1,0))+1)","v":""},"SINAPI-92775",{"$error":"#REF!"},13.31,{"$f":"ROUND(IF(ISNUMBER(R57),R57,IF(LEFT(R57,3)=\"BDI\",HLOOKUP(R57,DADOS!$T$37:$X$38,2,FALSE),0)),15-11*$X$5)","v":0.26390000000000002}]
["S",0,4,2,0,0,4,0,0,"Serviço","4.2.4.","SINAPI","92776","ARMAÇÃO DE PILAR OU VIGA DE UMA ESTRUTURA CONVENCIONAL DE CONCRETO ARMADO EM UMA EDIFICAÇÃO TÉRREA OU SOBRADO UTILIZANDO AÇO CA-50 DE 6,3 MM - MONTAGEM. AF_12/2015","KG",12.24,null,"BDI 1",0,0,"SEM VALOR",{"$f":"IF(OR($A58=0,$A58=\"S\",$A58>CFF!$A$9),\"\",MAX(V$12:OFFSET(V58,-1,0))+1)","v":""},"SINAPI-92776",{"$error":"#REF!"},11.5,{"$f":"ROUND(IF(ISNUMBER(R58),R58,IF(LEFT(R58,3)=\"BDI\",HLOOKUP(R58,DADOS!$T$37:$X$38,2,FALSE),0)),15-11*$X$5)","v":0.26390000000000002}]
["S",0,4,2,0,0,5,0,0,"Serviço","4.2.5.","SINAPI","92777","ARMAÇÃO DE PILAR OU VIGA DE UMA ESTRUTURA CONVENCIONAL DE CONCRETO ARMADO EM UMA EDIFICAÇÃO TÉRREA OU SOBRADO UTILIZANDO AÇO CA-50 DE 8,0 MM - MONTAGEM. AF_12/2015","KG",91.35,null,"BDI 1",0,0,"SEM VALOR",{"$f":"IF(OR($A59=0,$A59=\"S\",$A59>CFF!$A$9),\"\",MAX(V$12:OFFSET(V59,-1,0))+1)","v":""},"SINAPI-92777",{"$error":"#REF!"},10.93,{"$f":"ROUND(IF(ISNUMBER(R59),R59,IF(LEFT(R59,3)=\"BDI\",HLOOKUP(R59,DADOS!$T$37:$X$38,2,FALSE),0)),15-11*$X$5)","v":0.26390000000000002}]
["S",0,4,2,0,0,6,0,0,"Serviço","4.2.6.","SINAPI","92778","ARMAÇÃO DE PILAR OU VIGA DE UMA ESTRUTURA CONVENCIONAL DE CONCRETO ARMADO EM UMA EDIFICAÇÃO TÉRREA OU SOBRADO UTILIZANDO AÇO CA-50 DE 10,0 MM - MONTAGEM. AF_12/2015","KG",239.04,null,"BDI 1",0,0,"SEM VALOR",{"$f":"IF(OR($A60=0,$A60=\"S\",$A60>CFF!$A$9),\"\",MAX(V$12:OFFSET(V60,-1,0))+1)","v":""},"SINAPI-92778",{"$error":"#REF!"},8.8699999999999992,{"$f":"ROUND(IF(ISNUMBER(R60),R60,IF(LEFT(R60,3)=\"BDI\",HLOOKUP(R60,DADOS!$T$37:$X$38,2,FALSE),0)),15-11*$X$5)","v":0.26390000000000002}]
["S",0,4,2,0,0,7,0,0,"Serviço","4.2.7.","SINAPI","92779","ARMAÇÃO DE PILAR OU VIGA DE UMA ESTRUTURA CONVENCIONAL DE CONCRETO ARMADO EM UMA EDIFICAÇÃO TÉRREA OU SOBRADO UTILIZANDO AÇO CA-50 DE 12,5 MM - MONTAGEM. AF_12/2015","KG",25.2,null,"BDI 1",0,0,"SEM VALOR",{"$f":"IF(OR($A61=0,$A61=\"S\",$A61>CFF!$A$9),\"\",MAX(V$12:OFFSET(V61,-1,0))+1)","v":""},"SINAPI-92779",{"$error":"#REF!"},7.81,{"$f":"ROUND(IF(ISNUMBER(R61),R61,IF(LEFT(R61,3)=\"BDI\",HLOOKUP(R61,DADOS!$T$37:$X$38,2,FALSE),0)),15-11*$X$5)","v":0.26390000000000002}]
[2,2,4,3,0,0,0,33,2,"Nível 2","4.3.","SINAPI",null,"LAJES - TÉRREO","",0,null,"BDI 1",0,0,"SEM VALOR",{"$f":"IF(OR($A62=0,$A62=\"S\",$A62>CFF!$A$9),\"\",MAX(V$12:OFFSET(V62,-1,0))+1)","v":9},false,"X",0,{"$f":"ROUND(IF(ISNUMBER(R62),R62,IF(LEFT(R62,3)=\"BDI\",HLOOKUP(R62,DADOS!$T$37:$X$38,2,FALSE),0)),15-11*$X$5)","v":0.26390000000000002}]
["S",0,4,3,0,0,1,0,0,"Serviço","4.3.1.","COMP.","019","LAJE PRE-MOLDADA P/FORRO, SOBRECARGA 200 KG/M2, VAOS ATE 4,50M/ALTURA TOTAL=12CM, C/LAJOTAS E CAP.C/CONC. USINADO FCK=25MPA, 4CM,C/ESCORAMENTO (REAPR.3X) E FERRAGEM NEGATIVA, INCLUSO PROJETO E ART","M2",165.3,null,"BDI 1",0,0,"SEM VALOR",{"$f":"IF(OR($A63=0,$A63=\"S\",$A63>CFF!$A$9),\"\",MAX(V$12:OFFSET(V63,-1,0))+1)","v":""},"COMP.-019",{"$error":"#REF!"},90.03,{"$f":"ROUND(IF(ISNUMBER(R63),R63,IF(LEFT(R63,3)=\"BDI\",HLOOKUP(R63,DADOS!$T$37:$X$38,2,FALSE),0)),15-11*$X$5)","v":0.26390000000000002}]
[2,6,4,4,0,0,0,31,6,"Nível 2","4.4.","SINAPI",null,"PILARES - PLATIBANDA/CAIXA D'ÁGUA","",0,null,"BDI 1",0,0,"SEM VALOR",{"$f":"IF(OR($A64=0,$A64=\"S\",$A64>CFF!$A$9),\"\",MAX(V$12:OFFSET(V64,-1,0))+1)","v":10},false,"X",0,{"$f":"ROUND(IF(ISNUMBER(R64),R64,IF(LEFT(R64,3)=\"BDI\",HLOOKUP(R64,DADOS!$T$37:$X$38,2,FALSE),0)),15-11*$X$5)","v":0.26390000000000002}]
["S",0,4,4,0,0,1,0,0,"Serviço","4.4.1.","SINAPI","92434","MONTAGEM E DESMONTAGEM DE FÔRMA DE PILARES RETANGULARES E ESTRUTURAS SIMILARES COM ÁREA MÉDIA DAS SEÇÕES MENOR OU IGUAL A 0,25 M², PÉ-DIREITO SIMPLES, EM CHAPA DE MADEIRA COMPENSADA PLASTIFICADA, 12 UTILIZAÇÕES. AF_12/2015","M2",13.83,null,"BDI 1",0,0,"SEM VALOR",{"$f":"IF(OR($A65=0,$A65=\"S\",$A65>CFF!$A$9),\"\",MAX(V$12:OFFSET(V65,-1,0))+1)","v":""},"SINAPI-92434",{"$error":"#REF!"},48.13,{"$f":"ROUND(IF(ISNUMBER(R65),R65,IF(LEFT(R65,3)=\"BDI\",HLOOKUP(R65,DADOS!$T$37:$X$38,2,FALSE),0)),15-11*$X$5)","v":0.26390000000000002}]
["S",0,4,4,0,0,2,0,0,"Serviço","4.4.2.","SINAPI","92720","CONCRETAGEM DE PILARES, FCK = 25 MPA, COM USO DE BOMBA EM EDIFICAÇÃO COM SEÇÃO MÉDIA DE PILARES MENOR OU IGUAL A 0,25 M² - LANÇAMENTO, ADENSAMENTO E ACABAMENTO. AF_12/2015","M3",0.87,null,"BDI 1",0,0,"SEM VALOR",{"$f":"IF(OR($A66=0,$A66=\"S\",$A66>CFF!$A$9),\"\",MAX(V$12:OFFSET(V66,-1,0))+1)","v":""},"SINAPI-92720",{"$error":"#REF!"},480.32,{"$f":"ROUND(IF(ISNUMBER(R66),R66,IF(LEFT(R66,3)=\"BDI\",HLOOKUP(R66,DADOS!$T$37:$X$38,2,FALSE),0)),15-11*$X$5)","v":0.26390000000000002}]
["S",0,4,4,0,0,3,0,0,"Serviço","4.4.3.","SINAPI","92775","ARMAÇÃO DE PILAR OU VIGA DE UMA ESTRUTURA CONVENCIONAL DE CONCRETO ARMADO EM UMA EDIFICAÇÃO TÉRREA OU SOBRADO UTILIZANDO AÇO CA-60 DE 5,0 MM - MONTAGEM. AF_12/2015","KG",27.18,null,"BDI 1",0,0,"SEM VALOR",{"$f":"IF(OR($A67=0,$A67=\"S\",$A67>CFF!$A$9),\"\",MAX(V$12:OFFSET(V67,-1,0))+1)","v":""},"SINAPI-92775",{"$error":"#REF!"},13.31,{"$f":"ROUND(IF(ISNUMBER(R67),R67,IF(LEFT(R67,3)=\"BDI\",HLOOKUP(R67,DADOS!$T$37:$X$38,2,FALSE),0)),15-11*$X$5)","v":0.26390000000000002}]
["S",0,4,4,0,0,4,0,0,"Serviço","4.4.4.","SINAPI","92778","ARMAÇÃO DE PILAR OU VIGA DE UMA ESTRUTURA CONVENCIONAL DE CONCRETO ARMADO EM UMA EDIFICAÇÃO TÉRREA OU SOBRADO UTILIZANDO AÇO CA-50 DE 10,0 MM - MONTAGEM. AF_12/2015","KG",86.58,null,"BDI 1",0,0,"SEM VALOR",{"$f":"IF(OR($A68=0,$A68=\"S\",$A68>CFF!$A$9),\"\",MAX(V$12:OFFSET(V68,-1,0))+1)","v":""},"SINAPI-92778",{"$error":"#REF!"},8.8699999999999992,{"$f":"ROUND(IF(ISNUMBER(R68),R68,IF(LEFT(R68,3)=\"BDI\",HLOOKUP(R68,DADOS!$T$37:$X$38,2,FALSE),0)),15-11*$X$5)","v":0.26390000000000002}]
["S",0,4,4,0,0,5,0,0,"Serviço","4.4.5.","SINAPI","92779","ARMAÇÃO DE PILAR OU VIGA DE UMA ESTRUTURA CONVENCIONAL DE CONCRETO ARMADO EM UMA EDIFICAÇÃO TÉRREA OU SOBRADO UTILIZANDO AÇO CA-50 DE 12,5 MM - MONTAGEM. AF_12/2015","KG",8.01,null,"BDI 1",0,0,"SEM VALOR",{"$f":"IF(OR($A69=0,$A69=\"S\",$A69>CFF!$A$9),\"\",MAX(V$12:OFFSET(V69,-1,0))+1)","v":""},"SINAPI-92779",{"$error":"#REF!"},7.81,{"$f":"ROUND(IF(ISNUMBER(R69),R69,IF(LEFT(R69,3)=\"BDI\",HLOOKUP(R69,DADOS!$T$37:$X$38,2,FALSE),0)),15-11*$X$5)","v":0.26390000000000002}]
[2,6,4,5,0,0,0,25,6,"Nível 2","4.5.",null,null,"VIGAS - PLATIBANDA/CAIXA D'ÁGUA","",0,null,"BDI 1",0,0,"SEM VALOR",{"$f":"IF(OR($A70=0,$A70=\"S\",$A70>CFF!$A$9),\"\",MAX(V$12:OFFSET(V70,-1,0))+1)","v":11},false,"X",0,{"$f":"ROUND(IF(ISNUMBER(R70),R70,IF(LEFT(R70,3)=\"BDI\",HLOOKUP(R70,DADOS!$T$37:$X$38,2,FALSE),0)),15-11*$X$5)","v":0.26390000000000002}]
["S",0,4,5,0,0,1,0,0,"Serviço","4.5.1.","SINAPI","92479","MONTAGEM E DESMONTAGEM DE FÔRMA DE VIGA, ESCORAMENTO COM GARFO DE MADEIRA, PÉ-DIREITO SIMPLES, EM CHAPA DE MADEIRA PLASTIFICADA, 18 UTILIZAÇÕES. AF_12/2015","M2",26.52,null,"BDI 1",0,0,"SEM VALOR",{"$f":"IF(OR($A71=0,$A71=\"S\",$A71>CFF!$A$9),\"\",MAX(V$12:OFFSET(V71,-1,0))+1)","v":""},"SINAPI-92479",{"$error":"#REF!"},42,{"$f":"ROUND(IF(ISNUMBER(R71),R71,IF(LEFT(R71,3)=\"BDI\",HLOOKUP(R71,DADOS!$T$37:$X$38,2,FALSE),0)),15-11*$X$5)","v":0.26390000000000002}]
["S",0,4,5,0,0,2,0,0,"Serviço","4.5.2.","COMP.","017","CONCRETAGEM DE VIGAS E LAJES, FCK=25 MPA - LANÇAMENTO, ADENSAMENTO E ACABAMENTO","M3",1.74,null,"BDI 1",0,0,"SEM VALOR",{"$f":"IF(OR($A72=0,$A72=\"S\",$A72>CFF!$A$9),\"\",MAX(V$12:OFFSET(V72,-1,0))+1)","v":""},"COMP.-017",{"$error":"#REF!"},471.95,{"$f":"ROUND(IF(ISNUMBER(R72),R72,IF(LEFT(R72,3)=\"BDI\",HLOOKUP(R72,DADOS!$T$37:$X$38,2,FALSE),0)),15-11*$X$5)","v":0.26390000000000002}]
["S",0,4,5,0,0,3,0,0,"Serviço","4.5.3.","SINAPI","92775","ARMAÇÃO DE PILAR OU VIGA DE UMA ESTRUTURA CONVENCIONAL DE CONCRETO ARMADO EM UMA EDIFICAÇÃO TÉRREA OU SOBRADO UTILIZANDO AÇO CA-60 DE 5,0 MM - MONTAGEM. AF_12/2015","KG",80.37,null,"BDI 1",0,0,"SEM VALOR",{"$f":"IF(OR($A73=0,$A73=\"S\",$A73>CFF!$A$9),\"\",MAX(V$12:OFFSET(V73,-1,0))+1)","v":""},"SINAPI-92775",{"$error":"#REF!"},13.31,{"$f":"ROUND(IF(ISNUMBER(R73),R73,IF(LEFT(R73,3)=\"BDI\",HLOOKUP(R73,DADOS!$T$37:$X$38,2,FALSE),0)),15-11*$X$5)","v":0.26390000000000002}]
["S",0,4,5,0,0,4,0,0,"Serviço","4.5.4.","SINAPI","92777","ARMAÇÃO DE PILAR OU VIGA DE UMA ESTRUTURA CONVENCIONAL DE CONCRETO ARMADO EM UMA EDIFICAÇÃO TÉRREA OU SOBRADO UTILIZANDO AÇO CA-50 DE 8,0 MM - MONTAGEM. AF_12/2015","KG",94.41,null,"BDI 1",0,0,"SEM VALOR",{"$f":"IF(OR($A74=0,$A74=\"S\",$A74>CFF!$A$9),\"\",MAX(V$12:OFFSET(V74,-1,0))+1)","v":""},"SINAPI-92777",{"$error":"#REF!"},10.93,{"$f":"ROUND(IF(ISNUMBER(R74),R74,IF(LEFT(R74,3)=\"BDI\",HLOOKUP(R74,DADOS!$T$37:$X$38,2,FALSE),0)),15-11*$X$5)","v":0.26390000000000002}]
["S",0,4,5,0,0,5,0,0,"Serviço","4.5.5.","SINAPI","92778","ARMAÇÃO DE PILAR OU VIGA DE UMA ESTRUTURA CONVENCIONAL DE CONCRETO ARMADO EM UMA EDIFICAÇÃO TÉRREA OU SOBRADO UTILIZANDO AÇO CA-50 DE 10,0 MM - MONTAGEM. AF_12/2015","KG",30.51,null,"BDI 1",0,0,"SEM VALOR",{"$f":"IF(OR($A75=0,$A75=\"S\",$A75>CFF!$A$9),\"\",MAX(V$12:OFFSET(V75,-1,0))+1)","v":""},"SINAPI-92778",{"$error":"#REF!"},8.8699999999999992,{"$f":"ROUND(IF(ISNUMBER(R75),R75,IF(LEFT(R75,3)=\"BDI\",HLOOKUP(R75,DADOS!$T$37:$X$38,2,FALSE),0)),15-11*$X$5)","v":0.26390000000000002}]
[2,2,4,6,0,0,0,19,2,"Nível 2","4.6.","SINAPI",null,"LAJE - CAIXA D'ÁGUA","",0,null,"BDI 1",0,0,"SEM VALOR",{"$f":"IF(OR($A76=0,$A76=\"S\",$A76>CFF!$A$9),\"\",MAX(V$12:OFFSET(V76,-1,0))+1)","v":12},false,"X",0,{"$f":"ROUND(IF(ISNUMBER(R76),R76,IF(LEFT(R76,3)=\"BDI\",HLOOKUP(R76,DADOS!$T$37:$X$38,2,FALSE),0)),15-11*$X$5)","v":0.26390000000000002}]
["S",0,4,6,0,0,1,{"$f":"IF(OR($A77=\"S\",$A77=0),0,MATCH(0,OFFSET($B77,1,$A77,ROW($A$366)-ROW($A77)),0))","v":0},{"$f":"IF(OR($A77=\"S\",$A77=0),0,MATCH(OFFSET($B77,0,$A77)+1,OFFSET($B77,1,$A77,ROW($A$366)-ROW($A77)),0))","v":0},"Serviço","4.6.1.","COMP.","020","LAJE PRE-MOLDADA P/PISO, SOBRECARGA 750 KG/M2, VAOS ATE 3,50M/ ALTURA TOTAL=12CM, C/LAJOTAS E CAP.C/CONC. USINADO FCK=25MPA, 4CM E FERRAGEM NEGATIVA, INCLUSO PROJETO E ART","M2",10.32,null,"BDI 1",0,0,"SEM VALOR",{"$f":"IF(OR($A77=0,$A77=\"S\",$A77>CFF!$A$9),\"\",MAX(V$12:OFFSET(V77,-1,0))+1)","v":""},"COMP.-020",{"$error":"#REF!"},135.11000000000001,{"$f":"ROUND(IF(ISNUMBER(R77),R77,IF(LEFT(R77,3)=\"BDI\",HLOOKUP(R77,DADOS!$T$37:$X$38,2,FALSE),0)),15-11*$X$5)","v":0.26390000000000002}]
[2,5,4,7,0,0,0,17,5,"Nível 2","4.7.","SINAPI",null,"PILARES - COBERTURA","",0,null,"BDI 1",0,0,"SEM VALOR",{"$f":"IF(OR($A78=0,$A78=\"S\",$A78>CFF!$A$9),\"\",MAX(V$12:OFFSET(V78,-1,0))+1)","v":13},false,"X",0,{"$f":"ROUND(IF(ISNUMBER(R78),R78,IF(LEFT(R78,3)=\"BDI\",HLOOKUP(R78,DADOS!$T$37:$X$38,2,FALSE),0)),15-11*$X$5)","v":0.26390000000000002}]
["S",0,4,7,0,0,1,0,0,"Serviço","4.7.1.","SINAPI","92434","MONTAGEM E DESMONTAGEM DE FÔRMA DE PILARES RETANGULARES E ESTRUTURAS SIMILARES COM ÁREA MÉDIA DAS SEÇÕES MENOR OU IGUAL A 0,25 M², PÉ-DIREITO SIMPLES, EM CHAPA DE MADEIRA COMPENSADA PLASTIFICADA, 12 UTILIZAÇÕES. AF_12/2015","M2",3.9,null,"BDI 1",0,0,"SEM VALOR",{"$f":"IF(OR($A79=0,$A79=\"S\",$A79>CFF!$A$9),\"\",MAX(V$12:OFFSET(V79,-1,0))+1)","v":""},"SINAPI-92434",{"$error":"#REF!"},48.13,{"$f":"ROUND(IF(ISNUMBER(R79),R79,IF(LEFT(R79,3)=\"BDI\",HLOOKUP(R79,DADOS!$T$37:$X$38,2,FALSE),0)),15-11*$X$5)","v":0.26390000000000002}]
["S",0,4,7,0,0,2,0,0,"Serviço","4.7.2.","SINAPI","92720","CONCRETAGEM DE PILARES, FCK = 25 MPA, COM USO DE BOMBA EM EDIFICAÇÃO COM SEÇÃO MÉDIA DE PILARES MENOR OU IGUAL A 0,25 M² - LANÇAMENTO, ADENSAMENTO E ACABAMENTO. AF_12/2015","M3",0.25,null,"BDI 1",0,0,"SEM VALOR",{"$f":"IF(OR($A80=0,$A80=\"S\",$A80>CFF!$A$9),\"\",MAX(V$12:OFFSET(V80,-1,0))+1)","v":""},"SINAPI-92720",{"$error":"#REF!"},480.32,{"$f":"ROUND(IF(ISNUMBER(R80),R80,IF(LEFT(R80,3)=\"BDI\",HLOOKUP(R80,DADOS!$T$37:$X$38,2,FALSE),0)),15-11*$X$5)","v":0.26390000000000002}]
["S",0,4,7,0,0,3,0,0,"Serviço","4.7.3.","SINAPI","92775","ARMAÇÃO DE PILAR OU VIGA DE UMA ESTRUTURA CONVENCIONAL DE CONCRETO ARMADO EM UMA EDIFICAÇÃO TÉRREA OU SOBRADO UTILIZANDO AÇO CA-60 DE 5,0 MM - MONTAGEM. AF_12/2015","KG",6.93,null,"BDI 1",0,0,"SEM VALOR",{"$f":"IF(OR($A81=0,$A81=\"S\",$A81>CFF!$A$9),\"\",MAX(V$12:OFFSET(V81,-1,0))+1)","v":""},"SINAPI-92775",{"$error":"#REF!"},13.31,{"$f":"ROUND(IF(ISNUMBER(R81),R81,IF(LEFT(R81,3)=\"BDI\",HLOOKUP(R81,DADOS!$T$37:$X$38,2,FALSE),0)),15-11*$X$5)","v":0.26390000000000002}]
["S",0,4,7,0,0,4,0,0,"Serviço","4.7.4.","SINAPI","92778","ARMAÇÃO DE PILAR OU VIGA DE UMA ESTRUTURA CONVENCIONAL DE CONCRETO ARMADO EM UMA EDIFICAÇÃO TÉRREA OU SOBRADO UTILIZANDO AÇO CA-50 DE 10,0 MM - MONTAGEM. AF_12/2015","KG",16.29,null,"BDI 1",0,0,"SEM VALOR",{"$f":"IF(OR($A82=0,$A82=\"S\",$A82>CFF!$A$9),\"\",MAX(V$12:OFFSET(V82,-1,0))+1)","v":""},"SINAPI-92778",{"$error":"#REF!"},8.8699999999999992,{"$f":"ROUND(IF(ISNUMBER(R82),R82,IF(LEFT(R82,3)=\"BDI\",HLOOKUP(R82,DADOS!$T$37:$X$38,2,FALSE),0)),15-11*$X$5)","v":0.26390000000000002}]
[2,5,4,8,0,0,0,12,5,"Nível 2","4.8.","SINAPI",null,"VIGAS - COBERTURA","",0,null,"BDI 1",0,0,"SEM VALOR",{"$f":"IF(OR($A83=0,$A83=\"S\",$A83>CFF!$A$9),\"\",MAX(V$12:OFFSET(V83,-1,0))+1)","v":14},false,"X",0,{"$f":"ROUND(IF(ISNUMBER(R83),R83,IF(LEFT(R83,3)=\"BDI\",HLOOKUP(R83,DADOS!$T$37:$X$38,2,FALSE),0)),15-11*$X$5)","v":0.26390000000000002}]
["S",0,4,8,0,0,1,0,0,"Serviço","4.8.1.","SINAPI","92479","MONTAGEM E DESMONTAGEM DE FÔRMA DE VIGA, ESCORAMENTO COM GARFO DE MADEIRA, PÉ-DIREITO SIMPLES, EM CHAPA DE MADEIRA PLASTIFICADA, 18 UTILIZAÇÕES. AF_12/2015","M2",5.23,null,"BDI 1",0,0,"SEM VALOR",{"$f":"IF(OR($A84=0,$A84=\"S\",$A84>CFF!$A$9),\"\",MAX(V$12:OFFSET(V84,-1,0))+1)","v":""},"SINAPI-92479",{"$error":"#REF!"},42,{"$f":"ROUND(IF(ISNUMBER(R84),R84,IF(LEFT(R84,3)=\"BDI\",HLOOKUP(R84,DADOS!$T$37:$X$38,2,FALSE),0)),15-11*$X$5)","v":0.26390000000000002}]
["S",0,4,8,0,0,2,0,0,"Serviço","4.8.2.","SINAPI","92726","CONCRETAGEM DE VIGAS E LAJES, FCK=20 MPA, PARA LAJES MACIÇAS OU NERVURADAS COM USO DE BOMBA EM EDIFICAÇÃO COM ÁREA MÉDIA DE LAJES MAIOR QUE 20 M² - LANÇAMENTO, ADENSAMENTO E ACABAMENTO. AF_12/2015","M3",0.34,null,"BDI 1",0,0,"SEM VALOR",{"$f":"IF(OR($A85=0,$A85=\"S\",$A85>CFF!$A$9),\"\",MAX(V$12:OFFSET(V85,-1,0))+1)","v":""},"SINAPI-92726",{"$error":"#REF!"},455.57,{"$f":"ROUND(IF(ISNUMBER(R85),R85,IF(LEFT(R85,3)=\"BDI\",HLOOKUP(R85,DADOS!$T$37:$X$38,2,FALSE),0)),15-11*$X$5)","v":0.26390000000000002}]
["S",0,4,8,0,0,3,0,0,"Serviço","4.8.3.","SINAPI","92775","ARMAÇÃO DE PILAR OU VIGA DE UMA ESTRUTURA CONVENCIONAL DE CONCRETO ARMADO EM UMA EDIFICAÇÃO TÉRREA OU SOBRADO UTILIZANDO AÇO CA-60 DE 5,0 MM - MONTAGEM. AF_12/2015","KG",12.69,null,"BDI 1",0,0,"SEM VALOR",{"$f":"IF(OR($A86=0,$A86=\"S\",$A86>CFF!$A$9),\"\",MAX(V$12:OFFSET(V86,-1,0))+1)","v":""},"SINAPI-92775",{"$error":"#REF!"},13.31,{"$f":"ROUND(IF(ISNUMBER(R86),R86,IF(LEFT(R86,3)=\"BDI\",HLOOKUP(R86,DADOS!$T$37:$X$38,2,FALSE),0)),15-11*$X$5)","v":0.26390000000000002}]
["S",0,4,8,0,0,4,0,0,"Serviço","4.8.4.","SINAPI","92777","ARMAÇÃO DE PILAR OU VIGA DE UMA ESTRUTURA CONVENCIONAL DE CONCRETO ARMADO EM UMA EDIFICAÇÃO TÉRREA OU SOBRADO UTILIZANDO AÇO CA-50 DE 8,0 MM - MONTAGEM. AF_12/2015","KG",20.52,null,"BDI 1",0,0,"SEM VALOR",{"$f":"IF(OR($A87=0,$A87=\"S\",$A87>CFF!$A$9),\"\",MAX(V$12:OFFSET(V87,-1,0))+1)","v":""},"SINAPI-92777",{"$error":"#REF!"},10.93,{"$f":"ROUND(IF(ISNUMBER(R87),R87,IF(LEFT(R87,3)=\"BDI\",HLOOKUP(R87,DADOS!$T$37:$X$38,2,FALSE),0)),15-11*$X$5)","v":0.26390000000000002}]
[2,7,4,9,0,0,0,7,{"$error":"#N/A"},"Nível 2","4.9.",null,null,"VERGAS/CONTRA-VERGAS","",0,null,"BDI 1",0,0,"SEM VALOR",{"$f":"IF(OR($A88=0,$A88=\"S\",$A88>CFF!$A$9),\"\",MAX(V$12:OFFSET(V88,-1,0))+1)","v":15},false,"X",0,{"$f":"ROUND(IF(ISNUMBER(R88),R88,IF(LEFT(R88,3)=\"BDI\",HLOOKUP(R88,DADOS!$T$37:$X$38,2,FALSE),0)),15-11*$X$5)","v":0.26390000000000002}]
["S",0,4,9,0,0,1,0,0,"Serviço","4.9.1.","SINAPI","93184","VERGA PRÉ-MOLDADA PARA PORTAS COM ATÉ 1,5 M DE VÃO. AF_03/2016","M",16,null,"BDI 1",0,0,"SEM VALOR",{"$f":"IF(OR($A89=0,$A89=\"S\",$A89>CFF!$A$9),\"\",MAX(V$12:OFFSET(V89,-1,0))+1)","v":""},"SINAPI-93184",{"$error":"#REF!"},21.89,{"$f":"ROUND(IF(ISNUMBER(R89),R89,IF(LEFT(R89,3)=\"BDI\",HLOOKUP(R89,DADOS!$T$37:$X$38,2,FALSE),0)),15-11*$X$5)","v":0.26390000000000002}]
["S",0,4,9,0,0,2,0,0,"Serviço","4.9.2.","SINAPI","93185","VERGA PRÉ-MOLDADA PARA PORTAS COM MAIS DE 1,5 M DE VÃO. AF_03/2016","M",5.3,null,"BDI 1",0,0,"SEM VALOR",{"$f":"IF(OR($A90=0,$A90=\"S\",$A90>CFF!$A$9),\"\",MAX(V$12:OFFSET(V90,-1,0))+1)","v":""},"SINAPI-93185",{"$error":"#REF!"},36.19,{"$f":"ROUND(IF(ISNUMBER(R90),R90,IF(LEFT(R90,3)=\"BDI\",HLOOKUP(R90,DADOS!$T$37:$X$38,2,FALSE),0)),15-11*$X$5)","v":0.26390000000000002}]
["S",0,4,9,0,0,3,0,0,"Serviço","4.9.3.","SINAPI","93182","VERGA PRÉ-MOLDADA PARA JANELAS COM ATÉ 1,5 M DE VÃO. AF_03/2016","M",13,null,"BDI 1",0,0,"SEM VALOR",{"$f":"IF(OR($A91=0,$A91=\"S\",$A91>CFF!$A$9),\"\",MAX(V$12:OFFSET(V91,-1,0))+1)","v":""},"SINAPI-93182",{"$error":"#REF!"},28.78,{"$f":"ROUND(IF(ISNUMBER(R91),R91,IF(LEFT(R91,3)=\"BDI\",HLOOKUP(R91,DADOS!$T$37:$X$38,2,FALSE),0)),15-11*$X$5)","v":0.26390000000000002}]
["S",0,4,9,0,0,4,0,0,"Serviço","4.9.4.","SINAPI","93183","VERGA PRÉ-MOLDADA PARA JANELAS COM MAIS DE 1,5 M DE VÃO. AF_03/2016","M",14.05,null,"BDI 1",0,0,"SEM VALOR",{"$f":"IF(OR($A92=0,$A92=\"S\",$A92>CFF!$A$9),\"\",MAX(V$12:OFFSET(V92,-1,0))+1)","v":""},"SINAPI-93183",{"$error":"#REF!"},36.770000000000003,{"$f":"ROUND(IF(ISNUMBER(R92),R92,IF(LEFT(R92,3)=\"BDI\",HLOOKUP(R92,DADOS!$T$37:$X$38,2,FALSE),0)),15-11*$X$5)","v":0.26390000000000002}]
["S",0,4,9,0,0,5,0,0,"Serviço","4.9.5.","SINAPI","93194","CONTRAVERGA PRÉ-MOLDADA PARA VÃOS DE ATÉ 1,5 M DE COMPRIMENTO. AF_03/2016","M",13,null,"BDI 1",0,0,"SEM VALOR",{"$f":"IF(OR($A93=0,$A93=\"S\",$A93>CFF!$A$9),\"\",MAX(V$12:OFFSET(V93,-1,0))+1)","v":""},"SINAPI-93194",{"$error":"#REF!"},28.31,{"$f":"ROUND(IF(ISNUMBER(R93),R93,IF(LEFT(R93,3)=\"BDI\",HLOOKUP(R93,DADOS!$T$37:$X$38,2,FALSE),0)),15-11*$X$5)","v":0.26390000000000002}]
[{"$f":"CHOOSE(1+LOG(1+2*(J94=\"Meta\")+4*(J94=\"Nível 2\")+8*(J94=\"Nível 3\")+16*(J94=\"Nível 4\")+32*(J94=\"Serviço\"),2),0,1,2,3,4,\"S\")","v":"S"},{"$f":"IF(OR(A94=\"S\",A94=0),0,IF(ISERROR(I94),H94,SMALL(H94:I94,1)))","v":0},4,9,0,0,6,0,0,"Serviço",{"$f":"IF($A94=0,\"-\",CONCATENATE(C94&\".\",IF(AND($A$5>=2,$A94>=2),D94&\".\",\"\"),IF(AND($A$5>=3,$A94>=3),E94&\".\",\"\"),IF(AND($A$5>=4,$A94>=4),F94&\".\",\"\"),IF($A94=\"S\",G94&\".\",\"\")))","v":"4.9.6."},"SINAPI","93195","CONTRAVERGA PRÉ-MOLDADA PARA VÃOS DE MAIS DE 1,5 M DE COMPRIMENTO. AF_03/2016","M",14.05,null,"BDI 1",0,0,"SEM VALOR",{"$f":"IF(OR($A94=0,$A94=\"S\",$A94>CFF!$A$9),\"\",MAX(V$12:OFFSET(V94,-1,0))+1)","v":""},"SINAPI-93195",{"$error":"#REF!"},33.950000000000003,{"$f":"ROUND(IF(ISNUMBER(R94),R94,IF(LEFT(R94,3)=\"BDI\",HLOOKUP(R94,DADOS!$T$37:$X$38,2,FALSE),0)),15-11*$X$5)","v":0.26390000000000002}]
[1,3,5,0,0,0,0,271,3,"Meta","5.",null,null,"PAREDES E PAINÉIS","",0,null,"BDI 1",0,0,"SEM VALOR",{"$f":"IF(OR($A95=0,$A95=\"S\",$A95>CFF!$A$9),\"\",MAX(V$12:OFFSET(V95,-1,0))+1)","v":16},false,"X",0,{"$f":"ROUND(IF(ISNUMBER(R95),R95,IF(LEFT(R95,3)=\"BDI\",HLOOKUP(R95,DADOS!$T$37:$X$38,2,FALSE),0)),15-11*$X$5)","v":0.26390000000000002}]
[2,2,5,1,0,0,0,2,5,"Nível 2","5.1.",null,null,"ALVENARIA DE VEDAÇÃO","",0,null,"BDI 1",0,0,"SEM VALOR",{"$f":"IF(OR($A96=0,$A96=\"S\",$A96>CFF!$A$9),\"\",MAX(V$12:OFFSET(V96,-1,0))+1)","v":17},false,"X",0,{"$f":"ROUND(IF(ISNUMBER(R96),R96,IF(LEFT(R96,3)=\"BDI\",HLOOKUP(R96,DADOS!$T$37:$X$38,2,FALSE),0)),15-11*$X$5)","v":0.26390000000000002}]
["S",0,5,1,0,0,1,0,0,"Serviço","5.1.1.","SINAPI","87513","ALVENARIA DE VEDAÇÃO DE BLOCOS CERÂMICOS FURADOS NA HORIZONTAL DE 11,5X19X19CM (ESPESSURA 11,5CM) DE PAREDES COM ÁREA LÍQUIDA MENOR QUE 6M² COM VÃOS E ARGAMASSA DE ASSENTAMENTO COM PREPARO EM BETONEIRA. AF_06/2014","M2",284.20999999999998,null,"BDI 1",0,0,"SEM VALOR",{"$f":"IF(OR($A97=0,$A97=\"S\",$A97>CFF!$A$9),\"\",MAX(V$12:OFFSET(V97,-1,0))+1)","v":""},"SINAPI-87513",{"$error":"#REF!"},82.84,{"$f":"ROUND(IF(ISNUMBER(R97),R97,IF(LEFT(R97,3)=\"BDI\",HLOOKUP(R97,DADOS!$T$37:$X$38,2,FALSE),0)),15-11*$X$5)","v":0.26390000000000002}]
[1,19,6,0,0,0,0,268,19,"Meta","6.",null,null,"ESQUADRIAS","",0,null,"BDI 1",0,0,"SEM VALOR",{"$f":"IF(OR($A98=0,$A98=\"S\",$A98>CFF!$A$9),\"\",MAX(V$12:OFFSET(V98,-1,0))+1)","v":18},false,"X",0,{"$f":"ROUND(IF(ISNUMBER(R98),R98,IF(LEFT(R98,3)=\"BDI\",HLOOKUP(R98,DADOS!$T$37:$X$38,2,FALSE),0)),15-11*$X$5)","v":0.26390000000000002}]
[2,2,6,1,0,0,0,18,2,"Nível 2","6.1.",null,null,"PORTAS DE VIDRO","",0,null,"BDI 1",0,0,"SEM VALOR",{"$f":"IF(OR($A99=0,$A99=\"S\",$A99>CFF!$A$9),\"\",MAX(V$12:OFFSET(V99,-1,0))+1)","v":19},false,"X",0,{"$f":"ROUND(IF(ISNUMBER(R99),R99,IF(LEFT(R99,3)=\"BDI\",HLOOKUP(R99,DADOS!$T$37:$X$38,2,FALSE),0)),15-11*$X$5)","v":0.26390000000000002}]
["S",0,6,1,0,0,1,0,0,"Serviço","6.1.1.","SINAPI","68050","PORTA DE CORRER EM ALUMINIO, COM DUAS FOLHAS PARA VIDRO, INCLUSO VIDRO LISO INCOLOR, FECHADURA E PUXADOR, SEM GUARNICAO/ALIZAR/VISTA","M2",9.4499999999999993,null,"BDI 1",0,0,"SEM VALOR",{"$f":"IF(OR($A100=0,$A100=\"S\",$A100>CFF!$A$9),\"\",MAX(V$12:OFFSET(V100,-1,0))+1)","v":""},"SINAPI-68050",{"$error":"#REF!"},624.57000000000005,{"$f":"ROUND(IF(ISNUMBER(R100),R100,IF(LEFT(R100,3)=\"BDI\",HLOOKUP(R100,DADOS!$T$37:$X$38,2,FALSE),0)),15-11*$X$5)","v":0.26390000000000002}]
[2,8,6,2,0,0,0,16,8,"Nível 2","6.2.",null,null,"PORTA DE MADEIRA","",0,null,"BDI 1",0,0,"SEM VALOR",{"$f":"IF(OR($A101=0,$A101=\"S\",$A101>CFF!$A$9),\"\",MAX(V$12:OFFSET(V101,-1,0))+1)","v":20},false,"X",0,{"$f":"ROUND(IF(ISNUMBER(R101),R101,IF(LEFT(R101,3)=\"BDI\",HLOOKUP(R101,DADOS!$T$37:$X$38,2,FALSE),0)),15-11*$X$5)","v":0.26390000000000002}]
["S",0,6,2,0,0,1,0,0,"Serviço","6.2.1.","SINAPI","90843","KIT DE PORTA DE MADEIRA PARA PINTURA, SEMI-OCA (LEVE OU MÉDIA), PADRÃO MÉDIO, 80X210CM, ESPESSURA DE 3,5CM, ITENS INCLUSOS: DOBRADIÇAS, MONTAGEM E INSTALAÇÃO DO BATENTE, FECHADURA COM EXECUÇÃO DO FURO - FORNECIMENTO E INSTALAÇÃO. AF_08/2015","UN",6,null,"BDI 1",0,0,"SEM VALOR",{"$f":"IF(OR($A102=0,$A102=\"S\",$A102>CFF!$A$9),\"\",MAX(V$12:OFFSET(V102,-1,0))+1)","v":""},"SINAPI-90843",{"$error":"#REF!"},1006.89,{"$f":"ROUND(IF(ISNUMBER(R102),R102,IF(LEFT(R102,3)=\"BDI\",HLOOKUP(R102,DADOS!$T$37:$X$38,2,FALSE),0)),15-11*$X$5)","v":0.26390000000000002}]
["S",0,6,2,0,0,2,0,0,"Serviço","6.2.2.","SINAPI","90841","KIT DE PORTA DE MADEIRA PARA PINTURA, SEMI-OCA (LEVE OU MÉDIA), PADRÃO MÉDIO, 60X210CM, ESPESSURA DE 3,5CM, ITENS INCLUSOS: DOBRADIÇAS, MONTAGEM E INSTALAÇÃO DO BATENTE, FECHADURA COM EXECUÇÃO DO FURO - FORNECIMENTO E INSTALAÇÃO. AF_08/2015","UN",2,null,"BDI 1",0,0,"SEM VALOR",{"$f":"IF(OR($A103=0,$A103=\"S\",$A103>CFF!$A$9),\"\",MAX(V$12:OFFSET(V103,-1,0))+1)","v":""},"SINAPI-90841",{"$error":"#REF!"},922.32,{"$f":"ROUND(IF(ISNUMBER(R103),R103,IF(LEFT(R103,3)=\"BDI\",HLOOKUP(R103,DADOS!$T$37:$X$38,2,FALSE),0)),15-11*$X$5)","v":0.26390000000000002}]
["S",0,6,2,0,0,3,0,0,"Serviço","6.2.3.","SINAPI","73910/8","PORTA DE MADEIRA COMPENSADA LISA PARA PINTURA, 120X210X3,5CM, 2 FOLHAS, INCLUSO ADUELA 2A, ALIZAR 2A E DOBRADICAS","UN",2,null,"BDI 1",0,0,"SEM VALOR",{"$f":"IF(OR($A104=0,$A104=\"S\",$A104>CFF!$A$9),\"\",MAX(V$12:OFFSET(V104,-1,0))+1)","v":""},"SINAPI-73910/8",{"$error":"#REF!"},951.67,{"$f":"ROUND(IF(ISNUMBER(R104),R104,IF(LEFT(R104,3)=\"BDI\",HLOOKUP(R104,DADOS!$T$37:$X$38,2,FALSE),0)),15-11*$X$5)","v":0.26390000000000002}]
[{"$f":"CHOOSE(1+LOG(1+2*(J105=\"Meta\")+4*(J105=\"Nível 2\")+8*(J105=\"Nível 3\")+16*(J105=\"Nível 4\")+32*(J105=\"Serviço\"),2),0,1,2,3,4,\"S\")","v":"S"},{"$f":"IF(OR(A105=\"S\",A105=0),0,IF(ISERROR(I105),H105,SMALL(H105:I105,1)))","v":0},{"$f":"IF($A105=1,OFFSET(C105,-1,0)+1,OFFSET(C105,-1,0))","v":6},{"$f":"IF($A105=1,0,IF($A105=2,OFFSET(D105,-1,0)+1,OFFSET(D105,-1,0)))","v":2},{"$f":"IF(AND($A105<=2,$A105<>0),0,IF($A105=3,OFFSET(E105,-1,0)+1,OFFSET(E105,-1,0)))","v":0},{"$f":"IF(AND($A105<=3,$A105<>0),0,IF($A105=4,OFFSET(F105,-1,0)+1,OFFSET(F105,-1,0)))","v":0},{"$f":"IF(AND($A105<=4,$A105<>0),0,IF($A105=\"S\",OFFSET(G105,-1,0)+1,OFFSET(G105,-1,0)))","v":4},0,0,"Serviço",{"$f":"IF($A105=0,\"-\",CONCATENATE(C105&\".\",IF(AND($A$5>=2,$A105>=2),D105&\".\",\"\"),IF(AND($A$5>=3,$A105>=3),E105&\".\",\"\"),IF(AND($A$5>=4,$A105>=4),F105&\".\",\"\"),IF($A105=\"S\",G105&\".\",\"\")))","v":"6.2.4."},"SINAPI","90844","KIT DE PORTA DE MADEIRA PARA PINTURA, SEMI-OCA (LEVE OU MÉDIA), PADRÃO MÉDIO, 90X210CM, ESPESSURA DE 3,5CM, ITENS INCLUSOS: DOBRADIÇAS, MONTAGEM E INSTALAÇÃO DO BATENTE, FECHADURA COM EXECUÇÃO DO FURO - FORNECIMENTO E INSTALAÇÃO. AF_08/2015","UN",2,null,"BDI 1",{"$f":"IF($A105=\"S\",IF($Q$10=\"Preço Unitário (R$)\",PO.CustoUnitario,ROUND(PO.CustoUnitario*(1+$Z105),15-13*$X$6)),0)","v":0},{"$f":"IF($A105=\"S\",VTOTAL1,IF($A105=0,0,ROUND(SomaAgrup,15-13*$X$7)))","v":0},{"$f":"IF($J105=\"\",\"\",IF($N105=\"\",\"DESCRIÇÃO\",IF(AND($J105=\"Serviço\",$O105=\"\"),\"UNIDADE\",IF($T105<=0,\"SEM VALOR\",IF(AND($Y105<>\"\",$Q105>$Y105),\"ACIMA REF.\",\"\")))))","v":"SEM VALOR"},{"$f":"IF(OR($A105=0,$A105=\"S\",$A105>CFF!$A$9),\"\",MAX(V$12:OFFSET(V105,-1,0))+1)","v":""},{"$f":"IF(AND($J105=\"Serviço\",$M105<>\"\"),IF($L105=\"\",$M105,CONCATENATE($L105,\"-\",$M105)))","v":"SINAPI-90844"},{"$f":"IF(AND(Fonte<>\"\",Código<>\"\"),MATCH(Fonte&\" \"&IF(Fonte=\"sinapi\",SUBSTITUTE(SUBSTITUTE(Código,\"/00\",\"/\"),\"/0\",\"/\"),Código),INDIRECT(\"'[Referência \"&_xlnm.Database&\".xls]Banco'!$a:$a\"),0),\"X\")","v":{"$error":"#REF!"}},1043.93,{"$f":"ROUND(IF(ISNUMBER(R105),R105,IF(LEFT(R105,3)=\"BDI\",HLOOKUP(R105,DADOS!$T$37:$X$38,2,FALSE),0)),15-11*$X$5)","v":0.26390000000000002}]
["S",0,6,2,0,0,5,0,0,"Serviço","6.2.5.","SINAPI","91306","FECHADURA DE EMBUTIR PARA PORTAS INTERNAS, COMPLETA, ACABAMENTO PADRÃO MÉDIO, COM EXECUÇÃO DE FURO - FORNECIMENTO E INSTALAÇÃO. AF_08/2015","UN",2,null,"BDI 1",0,0,"SEM VALOR",{"$f":"IF(OR($A106=0,$A106=\"S\",$A106>CFF!$A$9),\"\",MAX(V$12:OFFSET(V106,-1,0))+1)","v":""},"SINAPI-91306",{"$error":"#REF!"},100.95,{"$f":"ROUND(IF(ISNUMBER(R106),R106,IF(LEFT(R106,3)=\"BDI\",HLOOKUP(R106,DADOS!$T$37:$X$38,2,FALSE),0)),15-11*$X$5)","v":0.26390000000000002}]
["S",0,6,2,0,0,6,0,0,"Serviço","6.2.6.","SINAPI-I","12760","CHAPA ACO INOX AISI 304 NUMERO 4 (E = 6 MM), ACABAMENTO NUMERO 1 (LAMINADO A QUENTE, FOSCO)","M2",0.72,null,"BDI 1",0,0,"SEM VALOR",{"$f":"IF(OR($A107=0,$A107=\"S\",$A107>CFF!$A$9),\"\",MAX(V$12:OFFSET(V107,-1,0))+1)","v":""},"SINAPI-I-12760",{"$error":"#REF!"},1175.19,{"$f":"ROUND(IF(ISNUMBER(R107),R107,IF(LEFT(R107,3)=\"BDI\",HLOOKUP(R107,DADOS!$T$37:$X$38,2,FALSE),0)),15-11*$X$5)","v":0.26390000000000002}]
["S",0,6,2,0,0,7,0,0,"Serviço","6.2.7.","SINAPI-I","36204","BARRA DE APOIO RETA, EM ACO INOX POLIDO, COMPRIMENTO 60CM, DIAMETRO MINIMO 3 CM","UN",2,null,"BDI 1",0,0,"SEM VALOR",{"$f":"IF(OR($A108=0,$A108=\"S\",$A108>CFF!$A$9),\"\",MAX(V$12:OFFSET(V108,-1,0))+1)","v":""},"SINAPI-I-36204",{"$error":"#REF!"},216.25,{"$f":"ROUND(IF(ISNUMBER(R108),R108,IF(LEFT(R108,3)=\"BDI\",HLOOKUP(R108,DADOS!$T$37:$X$38,2,FALSE),0)),15-11*$X$5)","v":0.26390000000000002}]
[2,3,6,3,0,0,0,8,3,"Nível 2","6.3.",null,null,"PORTAS METÁLICAS","",0,null,"BDI 1",0,0,"SEM VALOR",{"$f":"IF(OR($A109=0,$A109=\"S\",$A109>CFF!$A$9),\"\",MAX(V$12:OFFSET(V109,-1,0))+1)","v":21},false,"X",0,{"$f":"ROUND(IF(ISNUMBER(R109),R109,IF(LEFT(R109,3)=\"BDI\",HLOOKUP(R109,DADOS!$T$37:$X$38,2,FALSE),0)),15-11*$X$5)","v":0.26390000000000002}]
["S",0,6,3,0,0,1,0,0,"Serviço","6.3.1.","SINAPI","74100/1","PORTAO DE FERRO COM VARA 1/2\", COM REQUADRO","M2",1.89,null,"BDI 1",0,0,"SEM VALOR",{"$f":"IF(OR($A110=0,$A110=\"S\",$A110>CFF!$A$9),\"\",MAX(V$12:OFFSET(V110,-1,0))+1)","v":""},"SINAPI-74100/1",{"$error":"#REF!"},912.69,{"$f":"ROUND(IF(ISNUMBER(R110),R110,IF(LEFT(R110,3)=\"BDI\",HLOOKUP(R110,DADOS!$T$37:$X$38,2,FALSE),0)),15-11*$X$5)","v":0.26390000000000002}]
["S",0,6,3,0,0,2,0,0,"Serviço","6.3.2.","SINAPI","73933/1","PORTA DE FERRO, DE ABRIR, TIPO GRADE COM CHAPA, 87X210CM, COM GUARNICOES","M2",0.83,null,"BDI 1",0,0,"SEM VALOR",{"$f":"IF(OR($A111=0,$A111=\"S\",$A111>CFF!$A$9),\"\",MAX(V$12:OFFSET(V111,-1,0))+1)","v":""},"SINAPI-73933/1",{"$error":"#REF!"},1049.05,{"$f":"ROUND(IF(ISNUMBER(R111),R111,IF(LEFT(R111,3)=\"BDI\",HLOOKUP(R111,DADOS!$T$37:$X$38,2,FALSE),0)),15-11*$X$5)","v":0.26390000000000002}]
[2,2,6,4,0,0,0,5,2,"Nível 2","6.4.",null,null,"PORTA EM ALUMÍNIO","",0,null,"BDI 1",0,0,"SEM VALOR",{"$f":"IF(OR($A112=0,$A112=\"S\",$A112>CFF!$A$9),\"\",MAX(V$12:OFFSET(V112,-1,0))+1)","v":22},false,"X",0,{"$f":"ROUND(IF(ISNUMBER(R112),R112,IF(LEFT(R112,3)=\"BDI\",HLOOKUP(R112,DADOS!$T$37:$X$38,2,FALSE),0)),15-11*$X$5)","v":0.26390000000000002}]
["S",0,6,4,0,0,1,0,0,"Serviço","6.4.1.","SINAPI","91341","PORTA EM ALUMÍNIO DE ABRIR TIPO VENEZIANA COM GUARNIÇÃO, FIXAÇÃO COM PARAFUSOS - FORNECIMENTO E INSTALAÇÃO. AF_08/2015","M2",1.68,null,"BDI 1",0,0,"SEM VALOR",{"$f":"IF(OR($A113=0,$A113=\"S\",$A113>CFF!$A$9),\"\",MAX(V$12:OFFSET(V113,-1,0))+1)","v":""},"SINAPI-91341",{"$error":"#REF!"},814.91,{"$f":"ROUND(IF(ISNUMBER(R113),R113,IF(LEFT(R113,3)=\"BDI\",HLOOKUP(R113,DADOS!$T$37:$X$38,2,FALSE),0)),15-11*$X$5)","v":0.26390000000000002}]
[2,3,6,5,0,0,0,3,{"$error":"#N/A"},"Nível 2","6.5.",null,null,"JANELAS EM ALUMÍNIO","",0,null,"BDI 1",0,0,"SEM VALOR",{"$f":"IF(OR($A114=0,$A114=\"S\",$A114>CFF!$A$9),\"\",MAX(V$12:OFFSET(V114,-1,0))+1)","v":23},false,"X",0,{"$f":"ROUND(IF(ISNUMBER(R114),R114,IF(LEFT(R114,3)=\"BDI\",HLOOKUP(R114,DADOS!$T$37:$X$38,2,FALSE),0)),15-11*$X$5)","v":0.26390000000000002}]
["S",0,6,5,0,0,1,0,0,"Serviço","6.5.1.","SINAPI","94581","JANELA DE ALUMÍNIO MAXIM-AR, FIXAÇÃO COM ARGAMASSA, COM VIDROS, PADRONIZADA. AF_07/2016","M2",4,null,"BDI 1",0,0,"SEM VALOR",{"$f":"IF(OR($A115=0,$A115=\"S\",$A115>CFF!$A$9),\"\",MAX(V$12:OFFSET(V115,-1,0))+1)","v":""},"SINAPI-94581",{"$error":"#REF!"},1102.01,{"$f":"ROUND(IF(ISNUMBER(R115),R115,IF(LEFT(R115,3)=\"BDI\",HLOOKUP(R115,DADOS!$T$37:$X$38,2,FALSE),0)),15-11*$X$5)","v":0.26390000000000002}]
["S",0,6,5,0,0,2,0,0,"Serviço","6.5.2.","SINAPI","94582","JANELA DE ALUMÍNIO DE CORRER, 2 FOLHAS, FIXAÇÃO COM ARGAMASSA, COM VIDROS, PADRONIZADA. AF_07/2016","M2",19.64,null,"BDI 1",0,0,"SEM VALOR",{"$f":"IF(OR($A116=0,$A116=\"S\",$A116>CFF!$A$9),\"\",MAX(V$12:OFFSET(V116,-1,0))+1)","v":""},"SINAPI-94582",{"$error":"#REF!"},704.64,{"$f":"ROUND(IF(ISNUMBER(R116),R116,IF(LEFT(R116,3)=\"BDI\",HLOOKUP(R116,DADOS!$T$37:$X$38,2,FALSE),0)),15-11*$X$5)","v":0.26390000000000002}]
[1,12,7,0,0,0,0,249,12,"Meta","7.",null,null,"COBERTURA","",0,null,"BDI 1",0,0,"SEM VALOR",{"$f":"IF(OR($A117=0,$A117=\"S\",$A117>CFF!$A$9),\"\",MAX(V$12:OFFSET(V117,-1,0))+1)","v":24},false,"X",0,{"$f":"ROUND(IF(ISNUMBER(R117),R117,IF(LEFT(R117,3)=\"BDI\",HLOOKUP(R117,DADOS!$T$37:$X$38,2,FALSE),0)),15-11*$X$5)","v":0.26390000000000002}]
["S",0,7,0,0,0,1,0,0,"Serviço","7.0.1.","SINAPI","92543","TRAMA DE MADEIRA COMPOSTA POR TERÇAS PARA TELHADOS DE ATÉ 2 ÁGUAS PARA TELHA ONDULADA DE FIBROCIMENTO, METÁLICA, PLÁSTICA OU TERMOACÚSTICA, INCLUSO TRANSPORTE VERTICAL. AF_12/2015","M2",112.13,null,"BDI 1",0,0,"SEM VALOR",{"$f":"IF(OR($A118=0,$A118=\"S\",$A118>CFF!$A$9),\"\",MAX(V$12:OFFSET(V118,-1,0))+1)","v":""},"SINAPI-92543",{"$error":"#REF!"},13.93,{"$f":"ROUND(IF(ISNUMBER(R118),R118,IF(LEFT(R118,3)=\"BDI\",HLOOKUP(R118,DADOS!$T$37:$X$38,2,FALSE),0)),15-11*$X$5)","v":0.26390000000000002}]
["S",0,7,0,0,0,2,0,0,"Serviço","7.0.2.","SINAPI","92580","TRAMA DE AÇO COMPOSTA POR TERÇAS PARA TELHADOS DE ATÉ 2 ÁGUAS PARA TELHA ONDULADA DE FIBROCIMENTO, METÁLICA, PLÁSTICA OU TERMOACÚSTICA, INCLUSO TRANSPORTE VERTICAL. AF_12/2015","M2",8.4700000000000006,null,"BDI 1",0,0,"SEM VALOR",{"$f":"IF(OR($A119=0,$A119=\"S\",$A119>CFF!$A$9),\"\",MAX(V$12:OFFSET(V119,-1,0))+1)","v":""},"SINAPI-92580",{"$error":"#REF!"},36.25,{"$f":"ROUND(IF(ISNUMBER(R119),R119,IF(LEFT(R119,3)=\"BDI\",HLOOKUP(R119,DADOS!$T$37:$X$38,2,FALSE),0)),15-11*$X$5)","v":0.26390000000000002}]
["S",0,7,0,0,0,3,0,0,"Serviço","7.0.3.","SINAPI","94213","TELHAMENTO COM TELHA DE AÇO/ALUMÍNIO E = 0,5 MM, COM ATÉ 2 ÁGUAS, INCLUSO IÇAMENTO. AF_06/2016","M2",124.47,null,"BDI 1",0,0,"SEM VALOR",{"$f":"IF(OR($A120=0,$A120=\"S\",$A120>CFF!$A$9),\"\",MAX(V$12:OFFSET(V120,-1,0))+1)","v":""},"SINAPI-94213",{"$error":"#REF!"},49.32,{"$f":"ROUND(IF(ISNUMBER(R120),R120,IF(LEFT(R120,3)=\"BDI\",HLOOKUP(R120,DADOS!$T$37:$X$38,2,FALSE),0)),15-11*$X$5)","v":0.26390000000000002}]
["S",0,7,0,0,0,4,0,0,"Serviço","7.0.4.","SINAPI","75220","CUMEEIRA EM PERFIL ONDULADO DE ALUMÍNIO","M",12.1,null,"BDI 1",0,0,"SEM VALOR",{"$f":"IF(OR($A121=0,$A121=\"S\",$A121>CFF!$A$9),\"\",MAX(V$12:OFFSET(V121,-1,0))+1)","v":""},"SINAPI-75220",{"$error":"#REF!"},41.39,{"$f":"ROUND(IF(ISNUMBER(R121),R121,IF(LEFT(R121,3)=\"BDI\",HLOOKUP(R121,DADOS!$T$37:$X$38,2,FALSE),0)),15-11*$X$5)","v":0.26390000000000002}]
["S",0,7,0,0,0,5,0,0,"Serviço","7.0.5.","SINAPI","94229","CALHA EM CHAPA DE AÇO GALVANIZADO NÚMERO 24, DESENVOLVIMENTO DE 100 CM, INCLUSO TRANSPORTE VERTICAL. AF_06/2016","M",27.2,null,"BDI 1",0,0,"SEM VALOR",{"$f":"IF(OR($A122=0,$A122=\"S\",$A122>CFF!$A$9),\"\",MAX(V$12:OFFSET(V122,-1,0))+1)","v":""},"SINAPI-94229",{"$error":"#REF!"},132.57,{"$f":"ROUND(IF(ISNUMBER(R122),R122,IF(LEFT(R122,3)=\"BDI\",HLOOKUP(R122,DADOS!$T$37:$X$38,2,FALSE),0)),15-11*$X$5)","v":0.26390000000000002}]
["S",0,7,0,0,0,6,0,0,"Serviço","7.0.6.","SINAPI","94228","CALHA EM CHAPA DE AÇO GALVANIZADO NÚMERO 24, DESENVOLVIMENTO DE 50 CM, INCLUSO TRANSPORTE VERTICAL. AF_06/2016","M",3.15,null,"BDI 1",0,0,"SEM VALOR",{"$f":"IF(OR($A123=0,$A123=\"S\",$A123>CFF!$A$9),\"\",MAX(V$12:OFFSET(V123,-1,0))+1)","v":""},"SINAPI-94228",{"$error":"#REF!"},68,{"$f":"ROUND(IF(ISNUMBER(R123),R123,IF(LEFT(R123,3)=\"BDI\",HLOOKUP(R123,DADOS!$T$37:$X$38,2,FALSE),0)),15-11*$X$5)","v":0.26390000000000002}]
["S",0,7,0,0,0,7,0,0,"Serviço","7.0.7.","COMP.","001","RUFO EM CHAPA DE AÇO GALVANIZADO NÚMERO 24, DESENVOLVIMENTO DE 100 CM, INCLUSO TRANSPORTE VERTICAL","M",27.2,null,"BDI 1",0,0,"SEM VALOR",{"$f":"IF(OR($A124=0,$A124=\"S\",$A124>CFF!$A$9),\"\",MAX(V$12:OFFSET(V124,-1,0))+1)","v":""},"COMP.-001",{"$error":"#REF!"},100.71,{"$f":"ROUND(IF(ISNUMBER(R124),R124,IF(LEFT(R124,3)=\"BDI\",HLOOKUP(R124,DADOS!$T$37:$X$38,2,FALSE),0)),15-11*$X$5)","v":0.26390000000000002}]
["S",0,7,0,0,0,8,0,0,"Serviço","7.0.8.","COMP.","002","RUFO EM CHAPA DE AÇO GALVANIZADO NÚMERO 24, DESENVOLVIMENTO MÉDIO DE 50 CM, INCLUSO TRANSPORTE VERTICAL","M",40.58,null,"BDI 1",0,0,"SEM VALOR",{"$f":"IF(OR($A125=0,$A125=\"S\",$A125>CFF!$A$9),\"\",MAX(V$12:OFFSET(V125,-1,0))+1)","v":""},"COMP.-002",{"$error":"#REF!"},50.68,{"$f":"ROUND(IF(ISNUMBER(R125),R125,IF(LEFT(R125,3)=\"BDI\",HLOOKUP(R125,DADOS!$T$37:$X$38,2,FALSE),0)),15-11*$X$5)","v":0.26390000000000002}]
["S",0,7,0,0,0,9,0,0,"Serviço","7.0.9.","SINAPI","71623","CHAPIM DE CONCRETO APARENTE COM ACABAMENTO DESEMPENADO, FORMA DE COMPENSADO PLASTIFICADO (MADEIRIT) DE 14 X 10 CM, FUNDIDO NO LOCAL.","M",14.55,null,"BDI 1",0,0,"SEM VALOR",{"$f":"IF(OR($A126=0,$A126=\"S\",$A126>CFF!$A$9),\"\",MAX(V$12:OFFSET(V126,-1,0))+1)","v":""},"SINAPI-71623",{"$error":"#REF!"},32.200000000000003,{"$f":"ROUND(IF(ISNUMBER(R126),R126,IF(LEFT(R126,3)=\"BDI\",HLOOKUP(R126,DADOS!$T$37:$X$38,2,FALSE),0)),15-11*$X$5)","v":0.26390000000000002}]
["S",0,7,0,0,0,10,0,0,"Serviço","7.0.10.","SINAPI","73968/1","MANTA IMPERMEABILIZANTE A BASE DE ASFALTO - FORNECIMENTO E INSTALACAO","M2",0.62,null,"BDI 1",0,0,"SEM VALOR",{"$f":"IF(OR($A127=0,$A127=\"S\",$A127>CFF!$A$9),\"\",MAX(V$12:OFFSET(V127,-1,0))+1)","v":""},"SINAPI-73968/1",{"$error":"#REF!"},48.21,{"$f":"ROUND(IF(ISNUMBER(R127),R127,IF(LEFT(R127,3)=\"BDI\",HLOOKUP(R127,DADOS!$T$37:$X$38,2,FALSE),0)),15-11*$X$5)","v":0.26390000000000002}]
["S",0,7,0,0,0,11,0,0,"Serviço","7.0.11.","SINAPI","98560","IMPERMEABILIZAÇÃO DE PISO COM ARGAMASSA DE CIMENTO E AREIA, COM ADITIVO IMPERMEABILIZANTE, E = 2CM. AF_06/2018","M2",8.16,null,"BDI 1",0,0,"SEM VALOR",{"$f":"IF(OR($A128=0,$A128=\"S\",$A128>CFF!$A$9),\"\",MAX(V$12:OFFSET(V128,-1,0))+1)","v":""},"SINAPI-98560",{"$error":"#REF!"},41.72,{"$f":"ROUND(IF(ISNUMBER(R128),R128,IF(LEFT(R128,3)=\"BDI\",HLOOKUP(R128,DADOS!$T$37:$X$38,2,FALSE),0)),15-11*$X$5)","v":0.26390000000000002}]
[1,4,8,0,0,0,0,237,4,"Meta","8.",null,null,"IMPERMEABILIZAÇÃO","",0,null,"BDI 1",0,0,"SEM VALOR",{"$f":"IF(OR($A129=0,$A129=\"S\",$A129>CFF!$A$9),\"\",MAX(V$12:OFFSET(V129,-1,0))+1)","v":25},false,"X",0,{"$f":"ROUND(IF(ISNUMBER(R129),R129,IF(LEFT(R129,3)=\"BDI\",HLOOKUP(R129,DADOS!$T$37:$X$38,2,FALSE),0)),15-11*$X$5)","v":0.26390000000000002}]
["S",0,8,0,0,0,1,0,0,"Serviço","8.0.1.","SINAPI","74106/1","IMPERMEABILIZACAO DE ESTRUTURAS ENTERRADAS, COM TINTA ASFALTICA, DUAS DEMAOS.","M2",64.38,null,"BDI 1",0,0,"SEM VALOR",{"$f":"IF(OR($A130=0,$A130=\"S\",$A130>CFF!$A$9),\"\",MAX(V$12:OFFSET(V130,-1,0))+1)","v":""},"SINAPI-74106/1",{"$error":"#REF!"},10.93,{"$f":"ROUND(IF(ISNUMBER(R130),R130,IF(LEFT(R130,3)=\"BDI\",HLOOKUP(R130,DADOS!$T$37:$X$38,2,FALSE),0)),15-11*$X$5)","v":0.26390000000000002}]
["S",0,8,0,0,0,2,0,0,"Serviço","8.0.2.","SINAPI","98546","IMPERMEABILIZAÇÃO DE SUPERFÍCIE COM MANTA ASFÁLTICA, UMA CAMADA, INCLUSIVE APLICAÇÃO DE PRIMER ASFÁLTICO, E=3MM. AF_06/2018","M2",28.62,null,"BDI 1",0,0,"SEM VALOR",{"$f":"IF(OR($A131=0,$A131=\"S\",$A131>CFF!$A$9),\"\",MAX(V$12:OFFSET(V131,-1,0))+1)","v":""},"SINAPI-98546",{"$error":"#REF!"},81.599999999999994,{"$f":"ROUND(IF(ISNUMBER(R131),R131,IF(LEFT(R131,3)=\"BDI\",HLOOKUP(R131,DADOS!$T$37:$X$38,2,FALSE),0)),15-11*$X$5)","v":0.26390000000000002}]
["S",0,8,0,0,0,3,0,0,"Serviço","8.0.3.","SINAPI","98565","PROTEÇÃO MECÂNICA DE SUPERFICIE HORIZONTAL COM ARGAMASSA DE CIMENTO E AREIA, TRAÇO 1:3, E=3CM. AF_06/2018","M2",28.62,null,"BDI 1",0,0,"SEM VALOR",{"$f":"IF(OR($A132=0,$A132=\"S\",$A132>CFF!$A$9),\"\",MAX(V$12:OFFSET(V132,-1,0))+1)","v":""},"SINAPI-98565",{"$error":"#REF!"},42.69,{"$f":"ROUND(IF(ISNUMBER(R132),R132,IF(LEFT(R132,3)=\"BDI\",HLOOKUP(R132,DADOS!$T$37:$X$38,2,FALSE),0)),15-11*$X$5)","v":0.26390000000000002}]
[1,8,9,0,0,0,0,233,8,"Meta","9.",null,null,"REVESTIMENTOS","",0,null,"BDI 1",0,0,"SEM VALOR",{"$f":"IF(OR($A133=0,$A133=\"S\",$A133>CFF!$A$9),\"\",MAX(V$12:OFFSET(V133,-1,0))+1)","v":26},false,"X",0,{"$f":"ROUND(IF(ISNUMBER(R133),R133,IF(LEFT(R133,3)=\"BDI\",HLOOKUP(R133,DADOS!$T$37:$X$38,2,FALSE),0)),15-11*$X$5)","v":0.26390000000000002}]
["S",0,9,0,0,0,1,0,0,"Serviço","9.0.1.","SINAPI","87878","CHAPISCO APLICADO EM ALVENARIAS E ESTRUTURAS DE CONCRETO INTERNAS, COM COLHER DE PEDREIRO.  ARGAMASSA TRAÇO 1:3 COM PREPARO MANUAL. AF_06/2014","M2",569.03,null,"BDI 1",0,0,"SEM VALOR",{"$f":"IF(OR($A134=0,$A134=\"S\",$A134>CFF!$A$9),\"\",MAX(V$12:OFFSET(V134,-1,0))+1)","v":""},"SINAPI-87878",{"$error":"#REF!"},3.96,{"$f":"ROUND(IF(ISNUMBER(R134),R134,IF(LEFT(R134,3)=\"BDI\",HLOOKUP(R134,DADOS!$T$37:$X$38,2,FALSE),0)),15-11*$X$5)","v":0.26390000000000002}]
["S",0,9,0,0,0,2,0,0,"Serviço","9.0.2.","SINAPI","87904","CHAPISCO APLICADO EM ALVENARIA (COM PRESENÇA DE VÃOS) E ESTRUTURAS DE CONCRETO DE FACHADA, COM COLHER DE PEDREIRO.  ARGAMASSA TRAÇO 1:3 COM PREPARO MANUAL. AF_06/2014","M2",303.8,null,"BDI 1",0,0,"SEM VALOR",{"$f":"IF(OR($A135=0,$A135=\"S\",$A135>CFF!$A$9),\"\",MAX(V$12:OFFSET(V135,-1,0))+1)","v":""},"SINAPI-87904",{"$error":"#REF!"},7.89,{"$f":"ROUND(IF(ISNUMBER(R135),R135,IF(LEFT(R135,3)=\"BDI\",HLOOKUP(R135,DADOS!$T$37:$X$38,2,FALSE),0)),15-11*$X$5)","v":0.26390000000000002}]
["S",0,9,0,0,0,3,0,0,"Serviço","9.0.3.","SINAPI","87549","EMBOÇO, PARA RECEBIMENTO DE CERÂMICA, EM ARGAMASSA TRAÇO 1:2:8, PREPARO MECÂNICO COM BETONEIRA 400L, APLICADO MANUALMENTE EM FACES INTERNAS DE PAREDES, PARA AMBIENTE COM ÁREA ENTRE 5M2 E 10M2, ESPESSURA DE 10MM, COM EXECUÇÃO DE TALISCAS. AF_06/2014","M2",110.83,null,"BDI 1",0,0,"SEM VALOR",{"$f":"IF(OR($A136=0,$A136=\"S\",$A136>CFF!$A$9),\"\",MAX(V$12:OFFSET(V136,-1,0))+1)","v":""},"SINAPI-87549",{"$error":"#REF!"},19.079999999999998,{"$f":"ROUND(IF(ISNUMBER(R136),R136,IF(LEFT(R136,3)=\"BDI\",HLOOKUP(R136,DADOS!$T$37:$X$38,2,FALSE),0)),15-11*$X$5)","v":0.26390000000000002}]
["S",0,9,0,0,0,4,0,0,"Serviço","9.0.4.","SINAPI","87547","MASSA ÚNICA, PARA RECEBIMENTO DE PINTURA, EM ARGAMASSA TRAÇO 1:2:8, PREPARO MECÂNICO COM BETONEIRA 400L, APLICADA MANUALMENTE EM FACES INTERNAS DE PAREDES, ESPESSURA DE 10MM, COM EXECUÇÃO DE TALISCAS. AF_06/2014","M2",458.2,null,"BDI 1",0,0,"SEM VALOR",{"$f":"IF(OR($A137=0,$A137=\"S\",$A137>CFF!$A$9),\"\",MAX(V$12:OFFSET(V137,-1,0))+1)","v":""},"SINAPI-87547",{"$error":"#REF!"},20.21,{"$f":"ROUND(IF(ISNUMBER(R137),R137,IF(LEFT(R137,3)=\"BDI\",HLOOKUP(R137,DADOS!$T$37:$X$38,2,FALSE),0)),15-11*$X$5)","v":0.26390000000000002}]
["S",0,9,0,0,0,5,0,0,"Serviço","9.0.5.","COMP.","045","EMBOÇO OU MASSA ÚNICA EM ARGAMASSA TRAÇO 1:2:8, PREPARO MANUAL, APLICADA MANUALMENTE EM PANOS DE FACHADA COM PRESENÇA DE VÃOS, ESPESSURA DE 15 MM","M2",303.8,null,"BDI 1",0,0,"SEM VALOR",{"$f":"IF(OR($A138=0,$A138=\"S\",$A138>CFF!$A$9),\"\",MAX(V$12:OFFSET(V138,-1,0))+1)","v":""},"COMP.-045",{"$error":"#REF!"},31.5,{"$f":"ROUND(IF(ISNUMBER(R138),R138,IF(LEFT(R138,3)=\"BDI\",HLOOKUP(R138,DADOS!$T$37:$X$38,2,FALSE),0)),15-11*$X$5)","v":0.26390000000000002}]
["S",0,9,0,0,0,6,0,0,"Serviço","9.0.6.","SINAPI","87543","MASSA ÚNICA, PARA RECEBIMENTO DE PINTURA OU CERÂMICA, ARGAMASSA INDUSTRIALIZADA, PREPARO MECÂNICO, APLICADO COM EQUIPAMENTO DE MISTURA E PROJEÇÃO DE 1,5 M3/H EM FACES INTERNAS DE PAREDES, ESPESSURA DE 5MM, SEM EXECUÇÃO DE TALISCAS. AF_06/2014","M2",242.44,null,"BDI 1",0,0,"SEM VALOR",{"$f":"IF(OR($A139=0,$A139=\"S\",$A139>CFF!$A$9),\"\",MAX(V$12:OFFSET(V139,-1,0))+1)","v":""},"SINAPI-87543",{"$error":"#REF!"},15.63,{"$f":"ROUND(IF(ISNUMBER(R139),R139,IF(LEFT(R139,3)=\"BDI\",HLOOKUP(R139,DADOS!$T$37:$X$38,2,FALSE),0)),15-11*$X$5)","v":0.26390000000000002}]
["S",0,9,0,0,0,7,0,0,"Serviço","9.0.7.","COMP.","046","REVESTIMENTO CERÂMICO PARA PAREDES INTERNAS COM PLACAS TIPO ESMALTADA EXTRA  DE DIMENSÕES 30X40 CM APLICADAS EM AMBIENTES DE ÁREA MENOR QUE 5 M² NA ALTURA INTEIRA DAS PAREDES","M2",110.83,null,"BDI 1",0,0,"SEM VALOR",{"$f":"IF(OR($A140=0,$A140=\"S\",$A140>CFF!$A$9),\"\",MAX(V$12:OFFSET(V140,-1,0))+1)","v":""},"COMP.-046",{"$error":"#REF!"},72.64,{"$f":"ROUND(IF(ISNUMBER(R140),R140,IF(LEFT(R140,3)=\"BDI\",HLOOKUP(R140,DADOS!$T$37:$X$38,2,FALSE),0)),15-11*$X$5)","v":0.26390000000000002}]
[1,7,10,0,0,0,0,{"$f":"IF(OR($A141=\"S\",$A141=0),0,MATCH(0,OFFSET($B141,1,$A141,ROW($A$366)-ROW($A141)),0))","v":225},{"$f":"IF(OR($A141=\"S\",$A141=0),0,MATCH(OFFSET($B141,0,$A141)+1,OFFSET($B141,1,$A141,ROW($A$366)-ROW($A141)),0))","v":7},"Meta","10.",null,null,"PISOS","",0,null,"BDI 1",0,0,"SEM VALOR",{"$f":"IF(OR($A141=0,$A141=\"S\",$A141>CFF!$A$9),\"\",MAX(V$12:OFFSET(V141,-1,0))+1)","v":27},false,"X",0,{"$f":"ROUND(IF(ISNUMBER(R141),R141,IF(LEFT(R141,3)=\"BDI\",HLOOKUP(R141,DADOS!$T$37:$X$38,2,FALSE),0)),15-11*$X$5)","v":0.26390000000000002}]
[2,6,10,1,0,0,0,6,43,"Nível 2","10.1.",null,null,"PAVIMENTAÇÃO INTERNA","",0,null,"BDI 1",0,0,"SEM VALOR",{"$f":"IF(OR($A142=0,$A142=\"S\",$A142>CFF!$A$9),\"\",MAX(V$12:OFFSET(V142,-1,0))+1)","v":28},false,"X",0,{"$f":"ROUND(IF(ISNUMBER(R142),R142,IF(LEFT(R142,3)=\"BDI\",HLOOKUP(R142,DADOS!$T$37:$X$38,2,FALSE),0)),15-11*$X$5)","v":0.26390000000000002}]
["S",0,10,1,0,0,1,0,0,"Serviço","10.1.1.","COMP.","037","CONCRETAGEM DE LAJE SOBRE SOLO, FCK 25 MPA, ESPESSURA DE 7 CM, INCLUSO TELA SOLDADA NERVURADA Q-92 E BASE DE BRITA (5 CM) - LANÇAMENTO, ADENSAMENTO E ACABAMENTO","M2",150,null,"BDI 1",0,0,"SEM VALOR",{"$f":"IF(OR($A143=0,$A143=\"S\",$A143>CFF!$A$9),\"\",MAX(V$12:OFFSET(V143,-1,0))+1)","v":""},"COMP.-037",{"$error":"#REF!"},51.4,{"$f":"ROUND(IF(ISNUMBER(R143),R143,IF(LEFT(R143,3)=\"BDI\",HLOOKUP(R143,DADOS!$T$37:$X$38,2,FALSE),0)),15-11*$X$5)","v":0.26390000000000002}]
["S",0,10,1,0,0,2,0,0,"Serviço","10.1.2.","SINAPI","68053","FORNECIMENTO/INSTALACAO LONA PLASTICA PRETA, PARA IMPERMEABILIZACAO, ESPESSURA 150 MICRAS.","M2",148.30000000000001,null,"BDI 1",0,0,"SEM VALOR",{"$f":"IF(OR($A144=0,$A144=\"S\",$A144>CFF!$A$9),\"\",MAX(V$12:OFFSET(V144,-1,0))+1)","v":""},"SINAPI-68053",{"$error":"#REF!"},5.52,{"$f":"ROUND(IF(ISNUMBER(R144),R144,IF(LEFT(R144,3)=\"BDI\",HLOOKUP(R144,DADOS!$T$37:$X$38,2,FALSE),0)),15-11*$X$5)","v":0.26390000000000002}]
["S",0,10,1,0,0,3,0,0,"Serviço","10.1.3.","SINAPI","87622","CONTRAPISO EM ARGAMASSA TRAÇO 1:4 (CIMENTO E AREIA), PREPARO MANUAL, APLICADO EM ÁREAS SECAS SOBRE LAJE, ADERIDO, ESPESSURA 2CM. AF_06/2014","M2",148.30000000000001,null,"BDI 1",0,0,"SEM VALOR",{"$f":"IF(OR($A145=0,$A145=\"S\",$A145>CFF!$A$9),\"\",MAX(V$12:OFFSET(V145,-1,0))+1)","v":""},"SINAPI-87622",{"$error":"#REF!"},34.04,{"$f":"ROUND(IF(ISNUMBER(R145),R145,IF(LEFT(R145,3)=\"BDI\",HLOOKUP(R145,DADOS!$T$37:$X$38,2,FALSE),0)),15-11*$X$5)","v":0.26390000000000002}]
["S",0,10,1,0,0,4,0,0,"Serviço","10.1.4.","SINAPI","87251","REVESTIMENTO CERÂMICO PARA PISO COM PLACAS TIPO ESMALTADA EXTRA DE DIMENSÕES 45X45 CM APLICADA EM AMBIENTES DE ÁREA MAIOR QUE 10 M2. AF_06/2014","M2",146.82,null,"BDI 1",0,0,"SEM VALOR",{"$f":"IF(OR($A146=0,$A146=\"S\",$A146>CFF!$A$9),\"\",MAX(V$12:OFFSET(V146,-1,0))+1)","v":""},"SINAPI-87251",{"$error":"#REF!"},35.33,{"$f":"ROUND(IF(ISNUMBER(R146),R146,IF(LEFT(R146,3)=\"BDI\",HLOOKUP(R146,DADOS!$T$37:$X$38,2,FALSE),0)),15-11*$X$5)","v":0.26390000000000002}]
["S",0,10,1,0,0,5,0,0,"Serviço","10.1.5.","COMP.","027","PISO PODOTÁTIL INTERNO EM BORRACHA 25x25cm, E = 5 mm, ASSENTAMENTO COM COLA VINIL (FORNECIMENTO E ASSENTAMENTO)","M2",5.93,null,"BDI 1",0,0,"SEM VALOR",{"$f":"IF(OR($A147=0,$A147=\"S\",$A147>CFF!$A$9),\"\",MAX(V$12:OFFSET(V147,-1,0))+1)","v":""},"COMP.-027",{"$error":"#REF!"},182.05,{"$f":"ROUND(IF(ISNUMBER(R147),R147,IF(LEFT(R147,3)=\"BDI\",HLOOKUP(R147,DADOS!$T$37:$X$38,2,FALSE),0)),15-11*$X$5)","v":0.26390000000000002}]
[1,7,11,0,0,0,0,218,7,"Meta","11.",null,null,"PAVIMENTAÇÃO EXTERNA","",0,null,"BDI 1",0,0,"SEM VALOR",{"$f":"IF(OR($A148=0,$A148=\"S\",$A148>CFF!$A$9),\"\",MAX(V$12:OFFSET(V148,-1,0))+1)","v":29},false,"X",0,{"$f":"ROUND(IF(ISNUMBER(R148),R148,IF(LEFT(R148,3)=\"BDI\",HLOOKUP(R148,DADOS!$T$37:$X$38,2,FALSE),0)),15-11*$X$5)","v":0.26390000000000002}]
["S",0,11,0,0,0,1,0,0,"Serviço","11.0.1.","SINAPI","92398","EXECUÇÃO DE PÁTIO/ESTACIONAMENTO EM PISO INTERTRAVADO, COM BLOCO RETANGULAR COR NATURAL DE 20 X 10 CM, ESPESSURA 8 CM. AF_12/2015","M2",222.97,null,"BDI 1",0,0,"SEM VALOR",{"$f":"IF(OR($A149=0,$A149=\"S\",$A149>CFF!$A$9),\"\",MAX(V$12:OFFSET(V149,-1,0))+1)","v":""},"SINAPI-92398",{"$error":"#REF!"},57.36,{"$f":"ROUND(IF(ISNUMBER(R149),R149,IF(LEFT(R149,3)=\"BDI\",HLOOKUP(R149,DADOS!$T$37:$X$38,2,FALSE),0)),15-11*$X$5)","v":0.26390000000000002}]
["S",0,11,0,0,0,2,0,0,"Serviço","11.0.2.","SINAPI","94276","ASSENTAMENTO DE GUIA (MEIO-FIO) EM TRECHO CURVO, CONFECCIONADA EM CONCRETO PRÉ-FABRICADO, DIMENSÕES 100X15X13X20 CM (COMPRIMENTO X BASE INFERIOR X BASE SUPERIOR X ALTURA), PARA URBANIZAÇÃO INTERNA DE EMPREENDIMENTOS. AF_06/2016_P","M",63.24,null,"BDI 1",0,0,"SEM VALOR",{"$f":"IF(OR($A150=0,$A150=\"S\",$A150>CFF!$A$9),\"\",MAX(V$12:OFFSET(V150,-1,0))+1)","v":""},"SINAPI-94276",{"$error":"#REF!"},45.41,{"$f":"ROUND(IF(ISNUMBER(R150),R150,IF(LEFT(R150,3)=\"BDI\",HLOOKUP(R150,DADOS!$T$37:$X$38,2,FALSE),0)),15-11*$X$5)","v":0.26390000000000002}]
["S",0,11,0,0,0,3,0,0,"Serviço","11.0.3.","COMP.","013","PISO PODOTÁTIL DE ALERTA/DIRECIONAL, 25 X 25 CM, ESPESSURA 25MM, ASSENTADO COM ARGAMASSA TRACO 1:3 (CIMENTO E AREIA)","M²",12.41,null,"BDI 1",0,0,"SEM VALOR",{"$f":"IF(OR($A151=0,$A151=\"S\",$A151>CFF!$A$9),\"\",MAX(V$12:OFFSET(V151,-1,0))+1)","v":""},"COMP.-013",{"$error":"#REF!"},147.71,{"$f":"ROUND(IF(ISNUMBER(R151),R151,IF(LEFT(R151,3)=\"BDI\",HLOOKUP(R151,DADOS!$T$37:$X$38,2,FALSE),0)),15-11*$X$5)","v":0.26390000000000002}]
[{"$f":"CHOOSE(1+LOG(1+2*(J152=\"Meta\")+4*(J152=\"Nível 2\")+8*(J152=\"Nível 3\")+16*(J152=\"Nível 4\")+32*(J152=\"Serviço\"),2),0,1,2,3,4,\"S\")","v":"S"},{"$f":"IF(OR(A152=\"S\",A152=0),0,IF(ISERROR(I152),H152,SMALL(H152:I152,1)))","v":0},{"$f":"IF($A152=1,OFFSET(C152,-1,0)+1,OFFSET(C152,-1,0))","v":11},{"$f":"IF($A152=1,0,IF($A152=2,OFFSET(D152,-1,0)+1,OFFSET(D152,-1,0)))","v":0},{"$f":"IF(AND($A152<=2,$A152<>0),0,IF($A152=3,OFFSET(E152,-1,0)+1,OFFSET(E152,-1,0)))","v":0},{"$f":"IF(AND($A152<=3,$A152<>0),0,IF($A152=4,OFFSET(F152,-1,0)+1,OFFSET(F152,-1,0)))","v":0},{"$f":"IF(AND($A152<=4,$A152<>0),0,IF($A152=\"S\",OFFSET(G152,-1,0)+1,OFFSET(G152,-1,0)))","v":4},0,0,"Serviço",{"$f":"IF($A152=0,\"-\",CONCATENATE(C152&\".\",IF(AND($A$5>=2,$A152>=2),D152&\".\",\"\"),IF(AND($A$5>=3,$A152>=3),E152&\".\",\"\"),IF(AND($A$5>=4,$A152>=4),F152&\".\",\"\"),IF($A152=\"S\",G152&\".\",\"\")))","v":"11.0.4."},"COMP.","044","PISO PODOTÁTIL DE ALERTA, 40 X 40 CM, ESPESSURA 25MM, ASSENTADO COM ARGAMASSA TRACO 1:3 (CIMENTO E AREIA)","M²",0.64,null,"BDI 1",{"$f":"IF($A152=\"S\",IF($Q$10=\"Preço Unitário (R$)\",PO.CustoUnitario,ROUND(PO.CustoUnitario*(1+$Z152),15-13*$X$6)),0)","v":0},{"$f":"IF($A152=\"S\",VTOTAL1,IF($A152=0,0,ROUND(SomaAgrup,15-13*$X$7)))","v":0},{"$f":"IF($J152=\"\",\"\",IF($N152=\"\",\"DESCRIÇÃO\",IF(AND($J152=\"Serviço\",$O152=\"\"),\"UNIDADE\",IF($T152<=0,\"SEM VALOR\",IF(AND($Y152<>\"\",$Q152>$Y152),\"ACIMA REF.\",\"\")))))","v":"SEM VALOR"},{"$f":"IF(OR($A152=0,$A152=\"S\",$A152>CFF!$A$9),\"\",MAX(V$12:OFFSET(V152,-1,0))+1)","v":""},{"$f":"IF(AND($J152=\"Serviço\",$M152<>\"\"),IF($L152=\"\",$M152,CONCATENATE($L152,\"-\",$M152)))","v":"COMP.-044"},{"$f":"IF(AND(Fonte<>\"\",Código<>\"\"),MATCH(Fonte&\" \"&IF(Fonte=\"sinapi\",SUBSTITUTE(SUBSTITUTE(Código,\"/00\",\"/\"),\"/0\",\"/\"),Código),INDIRECT(\"'[Referência \"&_xlnm.Database&\".xls]Banco'!$a:$a\"),0),\"X\")","v":{"$error":"#REF!"}},147.71,{"$f":"ROUND(IF(ISNUMBER(R152),R152,IF(LEFT(R152,3)=\"BDI\",HLOOKUP(R152,DADOS!$T$37:$X$38,2,FALSE),0)),15-11*$X$5)","v":0.26390000000000002}]
["S",0,11,0,0,0,5,0,0,"Serviço","11.0.5.","SINAPI","98504","PLANTIO DE GRAMA EM PLACAS. AF_05/2018","M2",65.34,null,"BDI 1",0,0,"SEM VALOR",{"$f":"IF(OR($A153=0,$A153=\"S\",$A153>CFF!$A$9),\"\",MAX(V$12:OFFSET(V153,-1,0))+1)","v":""},"SINAPI-98504",{"$error":"#REF!"},16.22,{"$f":"ROUND(IF(ISNUMBER(R153),R153,IF(LEFT(R153,3)=\"BDI\",HLOOKUP(R153,DADOS!$T$37:$X$38,2,FALSE),0)),15-11*$X$5)","v":0.26390000000000002}]
["S",0,11,0,0,0,6,0,0,"Serviço","11.0.6.","SINAPI","94993","EXECUÇÃO DE PASSEIO (CALÇADA) OU PISO DE CONCRETO COM CONCRETO MOLDADO IN LOCO, USINADO, ACABAMENTO CONVENCIONAL, ESPESSURA 6 CM, ARMADO. AF_07/2016","M2",10.96,null,"BDI 1",0,0,"SEM VALOR",{"$f":"IF(OR($A154=0,$A154=\"S\",$A154>CFF!$A$9),\"\",MAX(V$12:OFFSET(V154,-1,0))+1)","v":""},"SINAPI-94993",{"$error":"#REF!"},63.38,{"$f":"ROUND(IF(ISNUMBER(R154),R154,IF(LEFT(R154,3)=\"BDI\",HLOOKUP(R154,DADOS!$T$37:$X$38,2,FALSE),0)),15-11*$X$5)","v":0.26390000000000002}]
[1,4,12,0,0,0,0,211,4,"Meta","12.",null,null,"RODAPÉS, PEITORIS E SOLEIRAS","",0,null,"BDI 1",0,0,"SEM VALOR",{"$f":"IF(OR($A155=0,$A155=\"S\",$A155>CFF!$A$9),\"\",MAX(V$12:OFFSET(V155,-1,0))+1)","v":30},false,"X",0,{"$f":"ROUND(IF(ISNUMBER(R155),R155,IF(LEFT(R155,3)=\"BDI\",HLOOKUP(R155,DADOS!$T$37:$X$38,2,FALSE),0)),15-11*$X$5)","v":0.26390000000000002}]
["S",0,12,0,0,0,1,0,0,"Serviço","12.0.1.","COMP.","025","PEITORIL DE GRANITO CINZA ANDORINHA L= 19 cm E=2CM, ASSENTADO COM ARGAMASSA TRACO 1:3 (CIMENTO E AREIA MEDIA), COM PINGADEIRA","M",21.45,null,"BDI 1",0,0,"SEM VALOR",{"$f":"IF(OR($A156=0,$A156=\"S\",$A156>CFF!$A$9),\"\",MAX(V$12:OFFSET(V156,-1,0))+1)","v":""},"COMP.-025",{"$error":"#REF!"},89.05,{"$f":"ROUND(IF(ISNUMBER(R156),R156,IF(LEFT(R156,3)=\"BDI\",HLOOKUP(R156,DADOS!$T$37:$X$38,2,FALSE),0)),15-11*$X$5)","v":0.26390000000000002}]
["S",0,12,0,0,0,2,0,0,"Serviço","12.0.2.","COMP.","024"," SOLEIRA DE GRANITO CINZA ANDORINHA L= 15cm E=2CM, ASSENTADA SOBRE ARGAMASSA TRACO 1:4 (CIMENTO E AREIA)","M",9.9,null,"BDI 1",0,0,"SEM VALOR",{"$f":"IF(OR($A157=0,$A157=\"S\",$A157>CFF!$A$9),\"\",MAX(V$12:OFFSET(V157,-1,0))+1)","v":""},"COMP.-024",{"$error":"#REF!"},103.84,{"$f":"ROUND(IF(ISNUMBER(R157),R157,IF(LEFT(R157,3)=\"BDI\",HLOOKUP(R157,DADOS!$T$37:$X$38,2,FALSE),0)),15-11*$X$5)","v":0.26390000000000002}]
["S",0,12,0,0,0,3,0,0,"Serviço","12.0.3.","SINAPI","88648","RODAPÉ CERÂMICO DE 7CM DE ALTURA COM PLACAS TIPO ESMALTADA EXTRA  DE DIMENSÕES 35X35CM. AF_06/2014","M",101.85,null,"BDI 1",0,0,"SEM VALOR",{"$f":"IF(OR($A158=0,$A158=\"S\",$A158>CFF!$A$9),\"\",MAX(V$12:OFFSET(V158,-1,0))+1)","v":""},"SINAPI-88648",{"$error":"#REF!"},5.32,{"$f":"ROUND(IF(ISNUMBER(R158),R158,IF(LEFT(R158,3)=\"BDI\",HLOOKUP(R158,DADOS!$T$37:$X$38,2,FALSE),0)),15-11*$X$5)","v":0.26390000000000002}]
[{"$f":"CHOOSE(1+LOG(1+2*(J159=\"Meta\")+4*(J159=\"Nível 2\")+8*(J159=\"Nível 3\")+16*(J159=\"Nível 4\")+32*(J159=\"Serviço\"),2),0,1,2,3,4,\"S\")","v":1},{"$f":"IF(OR(A159=\"S\",A159=0),0,IF(ISERROR(I159),H159,SMALL(H159:I159,1)))","v":8},13,0,0,0,0,207,8,"Meta",{"$f":"IF($A159=0,\"-\",CONCATENATE(C159&\".\",IF(AND($A$5>=2,$A159>=2),D159&\".\",\"\"),IF(AND($A$5>=3,$A159>=3),E159&\".\",\"\"),IF(AND($A$5>=4,$A159>=4),F159&\".\",\"\"),IF($A159=\"S\",G159&\".\",\"\")))","v":"13."},null,null,"PINTURA","",0,null,"BDI 1",0,0,"SEM VALOR",{"$f":"IF(OR($A159=0,$A159=\"S\",$A159>CFF!$A$9),\"\",MAX(V$12:OFFSET(V159,-1,0))+1)","v":31},false,"X",0,{"$f":"ROUND(IF(ISNUMBER(R159),R159,IF(LEFT(R159,3)=\"BDI\",HLOOKUP(R159,DADOS!$T$37:$X$38,2,FALSE),0)),15-11*$X$5)","v":0.26390000000000002}]
["S",0,13,0,0,0,1,0,0,"Serviço","13.0.1.","COMP.","026","APLICAÇÃO MANUAL DE MASSA ACRÍLICA EM PAREDES INTERNAS E TETOS, DUAS DEMÃOS","M2",426.49,null,"BDI 1",0,0,"SEM VALOR",{"$f":"IF(OR($A160=0,$A160=\"S\",$A160>CFF!$A$9),\"\",MAX(V$12:OFFSET(V160,-1,0))+1)","v":""},"COMP.-026",{"$error":"#REF!"},21.23,{"$f":"ROUND(IF(ISNUMBER(R160),R160,IF(LEFT(R160,3)=\"BDI\",HLOOKUP(R160,DADOS!$T$37:$X$38,2,FALSE),0)),15-11*$X$5)","v":0.26390000000000002}]
["S",0,13,0,0,0,2,0,0,"Serviço","13.0.2.","SINAPI","88489","APLICAÇÃO MANUAL DE PINTURA COM TINTA LÁTEX ACRÍLICA EM PAREDES, DUAS DEMÃOS. AF_06/2014","M2",278.22000000000003,null,"BDI 1",0,0,"SEM VALOR",{"$f":"IF(OR($A161=0,$A161=\"S\",$A161>CFF!$A$9),\"\",MAX(V$12:OFFSET(V161,-1,0))+1)","v":""},"SINAPI-88489",{"$error":"#REF!"},13.26,{"$f":"ROUND(IF(ISNUMBER(R161),R161,IF(LEFT(R161,3)=\"BDI\",HLOOKUP(R161,DADOS!$T$37:$X$38,2,FALSE),0)),15-11*$X$5)","v":0.26390000000000002}]
["S",0,13,0,0,0,3,0,0,"Serviço","13.0.3.","SINAPI","88488","APLICAÇÃO MANUAL DE PINTURA COM TINTA LÁTEX ACRÍLICA EM TETO, DUAS DEMÃOS. AF_06/2014","M2",148.27000000000001,null,"BDI 1",0,0,"SEM VALOR",{"$f":"IF(OR($A162=0,$A162=\"S\",$A162>CFF!$A$9),\"\",MAX(V$12:OFFSET(V162,-1,0))+1)","v":""},"SINAPI-88488",{"$error":"#REF!"},14.83,{"$f":"ROUND(IF(ISNUMBER(R162),R162,IF(LEFT(R162,3)=\"BDI\",HLOOKUP(R162,DADOS!$T$37:$X$38,2,FALSE),0)),15-11*$X$5)","v":0.26390000000000002}]
["S",0,13,0,0,0,4,0,0,"Serviço","13.0.4.","SINAPI","88485","APLICAÇÃO DE FUNDO SELADOR ACRÍLICO EM PAREDES, UMA DEMÃO. AF_06/2014","M2",242.44,null,"BDI 1",0,0,"SEM VALOR",{"$f":"IF(OR($A163=0,$A163=\"S\",$A163>CFF!$A$9),\"\",MAX(V$12:OFFSET(V163,-1,0))+1)","v":""},"SINAPI-88485",{"$error":"#REF!"},2.19,{"$f":"ROUND(IF(ISNUMBER(R163),R163,IF(LEFT(R163,3)=\"BDI\",HLOOKUP(R163,DADOS!$T$37:$X$38,2,FALSE),0)),15-11*$X$5)","v":0.26390000000000002}]
["S",0,13,0,0,0,5,0,0,"Serviço","13.0.5.","SINAPI","88489","APLICAÇÃO MANUAL DE PINTURA COM TINTA LÁTEX ACRÍLICA EM PAREDES, DUAS DEMÃOS. AF_06/2014","M2",242.44,null,"BDI 1",0,0,"SEM VALOR",{"$f":"IF(OR($A164=0,$A164=\"S\",$A164>CFF!$A$9),\"\",MAX(V$12:OFFSET(V164,-1,0))+1)","v":""},"SINAPI-88489",{"$error":"#REF!"},13.26,{"$f":"ROUND(IF(ISNUMBER(R164),R164,IF(LEFT(R164,3)=\"BDI\",HLOOKUP(R164,DADOS!$T$37:$X$38,2,FALSE),0)),15-11*$X$5)","v":0.26390000000000002}]
[{"$f":"CHOOSE(1+LOG(1+2*(J165=\"Meta\")+4*(J165=\"Nível 2\")+8*(J165=\"Nível 3\")+16*(J165=\"Nível 4\")+32*(J165=\"Serviço\"),2),0,1,2,3,4,\"S\")","v":"S"},{"$f":"IF(OR(A165=\"S\",A165=0),0,IF(ISERROR(I165),H165,SMALL(H165:I165,1)))","v":0},{"$f":"IF($A165=1,OFFSET(C165,-1,0)+1,OFFSET(C165,-1,0))","v":13},{"$f":"IF($A165=1,0,IF($A165=2,OFFSET(D165,-1,0)+1,OFFSET(D165,-1,0)))","v":0},{"$f":"IF(AND($A165<=2,$A165<>0),0,IF($A165=3,OFFSET(E165,-1,0)+1,OFFSET(E165,-1,0)))","v":0},{"$f":"IF(AND($A165<=3,$A165<>0),0,IF($A165=4,OFFSET(F165,-1,0)+1,OFFSET(F165,-1,0)))","v":0},{"$f":"IF(AND($A165<=4,$A165<>0),0,IF($A165=\"S\",OFFSET(G165,-1,0)+1,OFFSET(G165,-1,0)))","v":6},0,0,"Serviço",{"$f":"IF($A165=0,\"-\",CONCATENATE(C165&\".\",IF(AND($A$5>=2,$A165>=2),D165&\".\",\"\"),IF(AND($A$5>=3,$A165>=3),E165&\".\",\"\"),IF(AND($A$5>=4,$A165>=4),F165&\".\",\"\"),IF($A165=\"S\",G165&\".\",\"\")))","v":"13.0.6."},"SINAPI","84657","FUNDO SINTETICO NIVELADOR BRANCO","M2",53.55,null,"BDI 1",{"$f":"IF($A165=\"S\",IF($Q$10=\"Preço Unitário (R$)\",PO.CustoUnitario,ROUND(PO.CustoUnitario*(1+$Z165),15-13*$X$6)),0)","v":0},{"$f":"IF($A165=\"S\",VTOTAL1,IF($A165=0,0,ROUND(SomaAgrup,15-13*$X$7)))","v":0},{"$f":"IF($J165=\"\",\"\",IF($N165=\"\",\"DESCRIÇÃO\",IF(AND($J165=\"Serviço\",$O165=\"\"),\"UNIDADE\",IF($T165<=0,\"SEM VALOR\",IF(AND($Y165<>\"\",$Q165>$Y165),\"ACIMA REF.\",\"\")))))","v":"SEM VALOR"},{"$f":"IF(OR($A165=0,$A165=\"S\",$A165>CFF!$A$9),\"\",MAX(V$12:OFFSET(V165,-1,0))+1)","v":""},{"$f":"IF(AND($J165=\"Serviço\",$M165<>\"\"),IF($L165=\"\",$M165,CONCATENATE($L165,\"-\",$M165)))","v":"SINAPI-84657"},{"$f":"IF(AND(Fonte<>\"\",Código<>\"\"),MATCH(Fonte&\" \"&IF(Fonte=\"sinapi\",SUBSTITUTE(SUBSTITUTE(Código,\"/00\",\"/\"),\"/0\",\"/\"),Código),INDIRECT(\"'[Referência \"&_xlnm.Database&\".xls]Banco'!$a:$a\"),0),\"X\")","v":{"$error":"#REF!"}},11.16,{"$f":"ROUND(IF(ISNUMBER(R165),R165,IF(LEFT(R165,3)=\"BDI\",HLOOKUP(R165,DADOS!$T$37:$X$38,2,FALSE),0)),15-11*$X$5)","v":0.26390000000000002}]
["S",0,13,0,0,0,7,0,0,"Serviço","13.0.7.","SINAPI","74065/2","PINTURA ESMALTE ACETINADO PARA MADEIRA, DUAS DEMAOS, SOBRE FUNDO NIVELADOR BRANCO","M2",53.55,null,"BDI 1",0,0,"SEM VALOR",{"$f":"IF(OR($A166=0,$A166=\"S\",$A166>CFF!$A$9),\"\",MAX(V$12:OFFSET(V166,-1,0))+1)","v":""},"SINAPI-74065/2",{"$error":"#REF!"},25.72,{"$f":"ROUND(IF(ISNUMBER(R166),R166,IF(LEFT(R166,3)=\"BDI\",HLOOKUP(R166,DADOS!$T$37:$X$38,2,FALSE),0)),15-11*$X$5)","v":0.26390000000000002}]
[1,29,14,0,0,0,0,199,29,"Meta","14.",null,null,"INSTALAÇÃO HIDRÁULICA","",0,null,"BDI 1",0,0,"SEM VALOR",{"$f":"IF(OR($A167=0,$A167=\"S\",$A167>CFF!$A$9),\"\",MAX(V$12:OFFSET(V167,-1,0))+1)","v":32},false,"X",0,{"$f":"ROUND(IF(ISNUMBER(R167),R167,IF(LEFT(R167,3)=\"BDI\",HLOOKUP(R167,DADOS!$T$37:$X$38,2,FALSE),0)),15-11*$X$5)","v":0.26390000000000002}]
[2,17,14,1,0,0,0,28,17,"Nível 2","14.1.",null,null,"TUBULAÇÕES E CONEXÕES","",0,null,"BDI 1",0,0,"SEM VALOR",{"$f":"IF(OR($A168=0,$A168=\"S\",$A168>CFF!$A$9),\"\",MAX(V$12:OFFSET(V168,-1,0))+1)","v":33},false,"X",0,{"$f":"ROUND(IF(ISNUMBER(R168),R168,IF(LEFT(R168,3)=\"BDI\",HLOOKUP(R168,DADOS!$T$37:$X$38,2,FALSE),0)),15-11*$X$5)","v":0.26390000000000002}]
["S",0,14,1,0,0,1,0,0,"Serviço","14.1.1.","SINAPI","89402","TUBO, PVC, SOLDÁVEL, DN 25MM, INSTALADO EM RAMAL DE DISTRIBUIÇÃO DE ÁGUA - FORNECIMENTO E INSTALAÇÃO. AF_12/2014","M",37.5,null,"BDI 1",0,0,"SEM VALOR",{"$f":"IF(OR($A169=0,$A169=\"S\",$A169>CFF!$A$9),\"\",MAX(V$12:OFFSET(V169,-1,0))+1)","v":""},"SINAPI-89402",{"$error":"#REF!"},8.0500000000000007,{"$f":"ROUND(IF(ISNUMBER(R169),R169,IF(LEFT(R169,3)=\"BDI\",HLOOKUP(R169,DADOS!$T$37:$X$38,2,FALSE),0)),15-11*$X$5)","v":0.26390000000000002}]
["S",0,14,1,0,0,2,0,0,"Serviço","14.1.2.","SINAPI","89403","TUBO, PVC, SOLDÁVEL, DN 32MM, INSTALADO EM RAMAL DE DISTRIBUIÇÃO DE ÁGUA - FORNECIMENTO E INSTALAÇÃO. AF_12/2014","M",8.15,null,"BDI 1",0,0,"SEM VALOR",{"$f":"IF(OR($A170=0,$A170=\"S\",$A170>CFF!$A$9),\"\",MAX(V$12:OFFSET(V170,-1,0))+1)","v":""},"SINAPI-89403",{"$error":"#REF!"},13.09,{"$f":"ROUND(IF(ISNUMBER(R170),R170,IF(LEFT(R170,3)=\"BDI\",HLOOKUP(R170,DADOS!$T$37:$X$38,2,FALSE),0)),15-11*$X$5)","v":0.26390000000000002}]
["S",0,14,1,0,0,3,0,0,"Serviço","14.1.3.","SINAPI","89448","TUBO, PVC, SOLDÁVEL, DN 40MM, INSTALADO EM PRUMADA DE ÁGUA - FORNECIMENTO E INSTALAÇÃO. AF_12/2014","M",11.9,null,"BDI 1",0,0,"SEM VALOR",{"$f":"IF(OR($A171=0,$A171=\"S\",$A171>CFF!$A$9),\"\",MAX(V$12:OFFSET(V171,-1,0))+1)","v":""},"SINAPI-89448",{"$error":"#REF!"},12.49,{"$f":"ROUND(IF(ISNUMBER(R171),R171,IF(LEFT(R171,3)=\"BDI\",HLOOKUP(R171,DADOS!$T$37:$X$38,2,FALSE),0)),15-11*$X$5)","v":0.26390000000000002}]
["S",0,14,1,0,0,4,0,0,"Serviço","14.1.4.","SINAPI-I","829","BUCHA DE REDUCAO DE PVC, SOLDAVEL, CURTA, COM 32 X 25 MM, PARA AGUA FRIA PREDIAL","UN",2,null,"BDI 1",0,0,"SEM VALOR",{"$f":"IF(OR($A172=0,$A172=\"S\",$A172>CFF!$A$9),\"\",MAX(V$12:OFFSET(V172,-1,0))+1)","v":""},"SINAPI-I-829",{"$error":"#REF!"},0.72,{"$f":"ROUND(IF(ISNUMBER(R172),R172,IF(LEFT(R172,3)=\"BDI\",HLOOKUP(R172,DADOS!$T$37:$X$38,2,FALSE),0)),15-11*$X$5)","v":0.26390000000000002}]
["S",0,14,1,0,0,5,0,0,"Serviço","14.1.5.","SINAPI","90375","BUCHA DE REDUÇÃO, PVC, SOLDÁVEL, DN 40MM X 32MM, INSTALADO EM RAMAL OU SUB-RAMAL DE ÁGUA - FORNECIMENTO E INSTALAÇÃO. AF_03/2015","UN",1,null,"BDI 1",0,0,"SEM VALOR",{"$f":"IF(OR($A173=0,$A173=\"S\",$A173>CFF!$A$9),\"\",MAX(V$12:OFFSET(V173,-1,0))+1)","v":""},"SINAPI-90375",{"$error":"#REF!"},7.2,{"$f":"ROUND(IF(ISNUMBER(R173),R173,IF(LEFT(R173,3)=\"BDI\",HLOOKUP(R173,DADOS!$T$37:$X$38,2,FALSE),0)),15-11*$X$5)","v":0.26390000000000002}]
["S",0,14,1,0,0,6,0,0,"Serviço","14.1.6.","SINAPI-I","834","BUCHA DE REDUCAO DE PVC, SOLDAVEL, LONGA, COM 40 X 25 MM, PARA AGUA FRIA PREDIAL","UN",1,null,"BDI 1",0,0,"SEM VALOR",{"$f":"IF(OR($A174=0,$A174=\"S\",$A174>CFF!$A$9),\"\",MAX(V$12:OFFSET(V174,-1,0))+1)","v":""},"SINAPI-I-834",{"$error":"#REF!"},2.62,{"$f":"ROUND(IF(ISNUMBER(R174),R174,IF(LEFT(R174,3)=\"BDI\",HLOOKUP(R174,DADOS!$T$37:$X$38,2,FALSE),0)),15-11*$X$5)","v":0.26390000000000002}]
["S",0,14,1,0,0,7,0,0,"Serviço","14.1.7.","SINAPI","89362","JOELHO 90 GRAUS, PVC, SOLDÁVEL, DN 25MM, INSTALADO EM RAMAL OU SUB-RAMAL DE ÁGUA - FORNECIMENTO E INSTALAÇÃO. AF_12/2014","UN",15,null,"BDI 1",0,0,"SEM VALOR",{"$f":"IF(OR($A175=0,$A175=\"S\",$A175>CFF!$A$9),\"\",MAX(V$12:OFFSET(V175,-1,0))+1)","v":""},"SINAPI-89362",{"$error":"#REF!"},7.19,{"$f":"ROUND(IF(ISNUMBER(R175),R175,IF(LEFT(R175,3)=\"BDI\",HLOOKUP(R175,DADOS!$T$37:$X$38,2,FALSE),0)),15-11*$X$5)","v":0.26390000000000002}]
["S",0,14,1,0,0,8,0,0,"Serviço","14.1.8.","SINAPI","89367","JOELHO 90 GRAUS, PVC, SOLDÁVEL, DN 32MM, INSTALADO EM RAMAL OU SUB-RAMAL DE ÁGUA - FORNECIMENTO E INSTALAÇÃO. AF_12/2014","UN",7,null,"BDI 1",0,0,"SEM VALOR",{"$f":"IF(OR($A176=0,$A176=\"S\",$A176>CFF!$A$9),\"\",MAX(V$12:OFFSET(V176,-1,0))+1)","v":""},"SINAPI-89367",{"$error":"#REF!"},9.56,{"$f":"ROUND(IF(ISNUMBER(R176),R176,IF(LEFT(R176,3)=\"BDI\",HLOOKUP(R176,DADOS!$T$37:$X$38,2,FALSE),0)),15-11*$X$5)","v":0.26390000000000002}]
["S",0,14,1,0,0,9,0,0,"Serviço","14.1.9.","SINAPI","89497","JOELHO 90 GRAUS, PVC, SOLDÁVEL, DN 40MM, INSTALADO EM PRUMADA DE ÁGUA - FORNECIMENTO E INSTALAÇÃO. AF_12/2014","UN",3,null,"BDI 1",0,0,"SEM VALOR",{"$f":"IF(OR($A177=0,$A177=\"S\",$A177>CFF!$A$9),\"\",MAX(V$12:OFFSET(V177,-1,0))+1)","v":""},"SINAPI-89497",{"$error":"#REF!"},8.67,{"$f":"ROUND(IF(ISNUMBER(R177),R177,IF(LEFT(R177,3)=\"BDI\",HLOOKUP(R177,DADOS!$T$37:$X$38,2,FALSE),0)),15-11*$X$5)","v":0.26390000000000002}]
["S",0,14,1,0,0,10,0,0,"Serviço","14.1.10.","SINAPI","89363","JOELHO 45 GRAUS, PVC, SOLDÁVEL, DN 25MM, INSTALADO EM RAMAL OU SUB-RAMAL DE ÁGUA - FORNECIMENTO E INSTALAÇÃO. AF_12/2014","UN",2,null,"BDI 1",0,0,"SEM VALOR",{"$f":"IF(OR($A178=0,$A178=\"S\",$A178>CFF!$A$9),\"\",MAX(V$12:OFFSET(V178,-1,0))+1)","v":""},"SINAPI-89363",{"$error":"#REF!"},7.67,{"$f":"ROUND(IF(ISNUMBER(R178),R178,IF(LEFT(R178,3)=\"BDI\",HLOOKUP(R178,DADOS!$T$37:$X$38,2,FALSE),0)),15-11*$X$5)","v":0.26390000000000002}]
["S",0,14,1,0,0,11,0,0,"Serviço","14.1.11.","SINAPI-I","3538","JOELHO DE REDUCAO, PVC SOLDAVEL, 90 GRAUS,  32 MM X 25 MM, PARA AGUA FRIA PREDIAL","UN",1,null,"BDI 1",0,0,"SEM VALOR",{"$f":"IF(OR($A179=0,$A179=\"S\",$A179>CFF!$A$9),\"\",MAX(V$12:OFFSET(V179,-1,0))+1)","v":""},"SINAPI-I-3538",{"$error":"#REF!"},2.5499999999999998,{"$f":"ROUND(IF(ISNUMBER(R179),R179,IF(LEFT(R179,3)=\"BDI\",HLOOKUP(R179,DADOS!$T$37:$X$38,2,FALSE),0)),15-11*$X$5)","v":0.26390000000000002}]
["S",0,14,1,0,0,12,0,0,"Serviço","14.1.12.","SINAPI","89395","TE, PVC, SOLDÁVEL, DN 25MM, INSTALADO EM RAMAL OU SUB-RAMAL DE ÁGUA - FORNECIMENTO E INSTALAÇÃO. AF_12/2014","UN",7,null,"BDI 1",0,0,"SEM VALOR",{"$f":"IF(OR($A180=0,$A180=\"S\",$A180>CFF!$A$9),\"\",MAX(V$12:OFFSET(V180,-1,0))+1)","v":""},"SINAPI-89395",{"$error":"#REF!"},10,{"$f":"ROUND(IF(ISNUMBER(R180),R180,IF(LEFT(R180,3)=\"BDI\",HLOOKUP(R180,DADOS!$T$37:$X$38,2,FALSE),0)),15-11*$X$5)","v":0.26390000000000002}]
["S",0,14,1,0,0,13,0,0,"Serviço","14.1.13.","SINAPI","89398","TE, PVC, SOLDÁVEL, DN 32MM, INSTALADO EM RAMAL OU SUB-RAMAL DE ÁGUA - FORNECIMENTO E INSTALAÇÃO. AF_12/2014","UN",4,null,"BDI 1",0,0,"SEM VALOR",{"$f":"IF(OR($A181=0,$A181=\"S\",$A181>CFF!$A$9),\"\",MAX(V$12:OFFSET(V181,-1,0))+1)","v":""},"SINAPI-89398",{"$error":"#REF!"},13.41,{"$f":"ROUND(IF(ISNUMBER(R181),R181,IF(LEFT(R181,3)=\"BDI\",HLOOKUP(R181,DADOS!$T$37:$X$38,2,FALSE),0)),15-11*$X$5)","v":0.26390000000000002}]
["S",0,14,1,0,0,14,0,0,"Serviço","14.1.14.","SINAPI","89623","TE, PVC, SOLDÁVEL, DN 40MM, INSTALADO EM PRUMADA DE ÁGUA - FORNECIMENTO E INSTALAÇÃO. AF_12/2014","UN",2,null,"BDI 1",0,0,"SEM VALOR",{"$f":"IF(OR($A182=0,$A182=\"S\",$A182>CFF!$A$9),\"\",MAX(V$12:OFFSET(V182,-1,0))+1)","v":""},"SINAPI-89623",{"$error":"#REF!"},13.27,{"$f":"ROUND(IF(ISNUMBER(R182),R182,IF(LEFT(R182,3)=\"BDI\",HLOOKUP(R182,DADOS!$T$37:$X$38,2,FALSE),0)),15-11*$X$5)","v":0.26390000000000002}]
["S",0,14,1,0,0,15,0,0,"Serviço","14.1.15.","SINAPI-I","7128","TE DE REDUCAO, PVC, SOLDAVEL, 90 GRAUS, 40 MM X 32 MM, PARA AGUA FRIA PREDIAL","UN",1,null,"BDI 1",0,0,"SEM VALOR",{"$f":"IF(OR($A183=0,$A183=\"S\",$A183>CFF!$A$9),\"\",MAX(V$12:OFFSET(V183,-1,0))+1)","v":""},"SINAPI-I-7128",{"$error":"#REF!"},6.52,{"$f":"ROUND(IF(ISNUMBER(R183),R183,IF(LEFT(R183,3)=\"BDI\",HLOOKUP(R183,DADOS!$T$37:$X$38,2,FALSE),0)),15-11*$X$5)","v":0.26390000000000002}]
["S",0,14,1,0,0,16,0,0,"Serviço","14.1.16.","SINAPI","89378","LUVA, PVC, SOLDÁVEL, DN 25MM, INSTALADO EM RAMAL OU SUB-RAMAL DE ÁGUA - FORNECIMENTO E INSTALAÇÃO. AF_12/2014","UN",3,null,"BDI 1",0,0,"SEM VALOR",{"$f":"IF(OR($A184=0,$A184=\"S\",$A184>CFF!$A$9),\"\",MAX(V$12:OFFSET(V184,-1,0))+1)","v":""},"SINAPI-89378",{"$error":"#REF!"},5.33,{"$f":"ROUND(IF(ISNUMBER(R184),R184,IF(LEFT(R184,3)=\"BDI\",HLOOKUP(R184,DADOS!$T$37:$X$38,2,FALSE),0)),15-11*$X$5)","v":0.26390000000000002}]
[2,11,14,2,0,0,0,11,51,"Nível 2","14.2.",null,null,"ACESSÓRIOS E COMPLEMENTOS","",0,null,"BDI 1",0,0,"SEM VALOR",{"$f":"IF(OR($A185=0,$A185=\"S\",$A185>CFF!$A$9),\"\",MAX(V$12:OFFSET(V185,-1,0))+1)","v":34},false,"X",0,{"$f":"ROUND(IF(ISNUMBER(R185),R185,IF(LEFT(R185,3)=\"BDI\",HLOOKUP(R185,DADOS!$T$37:$X$38,2,FALSE),0)),15-11*$X$5)","v":0.26390000000000002}]
["S",0,14,2,0,0,1,0,0,"Serviço","14.2.1.","SINAPI","94703","ADAPTADOR COM FLANGE E ANEL DE VEDAÇÃO, PVC, SOLDÁVEL, DN  25 MM X 3/4 , INSTALADO EM RESERVAÇÃO DE ÁGUA DE EDIFICAÇÃO QUE POSSUA RESERVATÓRIO DE FIBRA/FIBROCIMENTO   FORNECIMENTO E INSTALAÇÃO. AF_06/2016","UN",2,null,"BDI 1",0,0,"SEM VALOR",{"$f":"IF(OR($A186=0,$A186=\"S\",$A186>CFF!$A$9),\"\",MAX(V$12:OFFSET(V186,-1,0))+1)","v":""},"SINAPI-94703",{"$error":"#REF!"},18.170000000000002,{"$f":"ROUND(IF(ISNUMBER(R186),R186,IF(LEFT(R186,3)=\"BDI\",HLOOKUP(R186,DADOS!$T$37:$X$38,2,FALSE),0)),15-11*$X$5)","v":0.26390000000000002}]
["S",0,14,2,0,0,2,0,0,"Serviço","14.2.2.","SINAPI","94704","ADAPTADOR COM FLANGE E ANEL DE VEDAÇÃO, PVC, SOLDÁVEL, DN 32 MM X 1 , INSTALADO EM RESERVAÇÃO DE ÁGUA DE EDIFICAÇÃO QUE POSSUA RESERVATÓRIO DE FIBRA/FIBROCIMENTO   FORNECIMENTO E INSTALAÇÃO. AF_06/2016","UN",4,null,"BDI 1",0,0,"SEM VALOR",{"$f":"IF(OR($A187=0,$A187=\"S\",$A187>CFF!$A$9),\"\",MAX(V$12:OFFSET(V187,-1,0))+1)","v":""},"SINAPI-94704",{"$error":"#REF!"},21.18,{"$f":"ROUND(IF(ISNUMBER(R187),R187,IF(LEFT(R187,3)=\"BDI\",HLOOKUP(R187,DADOS!$T$37:$X$38,2,FALSE),0)),15-11*$X$5)","v":0.26390000000000002}]
["S",0,14,2,0,0,3,0,0,"Serviço","14.2.3.","SINAPI","94705","ADAPTADOR COM FLANGE E ANEL DE VEDAÇÃO, PVC, SOLDÁVEL, DN 40 MM X 1 1/4 , INSTALADO EM RESERVAÇÃO DE ÁGUA DE EDIFICAÇÃO QUE POSSUA RESERVATÓRIO DE FIBRA/FIBROCIMENTO   FORNECIMENTO E INSTALAÇÃO. AF_06/2016","UN",2,null,"BDI 1",0,0,"SEM VALOR",{"$f":"IF(OR($A188=0,$A188=\"S\",$A188>CFF!$A$9),\"\",MAX(V$12:OFFSET(V188,-1,0))+1)","v":""},"SINAPI-94705",{"$error":"#REF!"},30.3,{"$f":"ROUND(IF(ISNUMBER(R188),R188,IF(LEFT(R188,3)=\"BDI\",HLOOKUP(R188,DADOS!$T$37:$X$38,2,FALSE),0)),15-11*$X$5)","v":0.26390000000000002}]
["S",0,14,2,0,0,4,0,0,"Serviço","14.2.4.","SINAPI","94656","ADAPTADOR CURTO COM BOLSA E ROSCA PARA REGISTRO, PVC, SOLDÁVEL, DN  25 MM X 3/4 , INSTALADO EM RESERVAÇÃO DE ÁGUA DE EDIFICAÇÃO QUE POSSUA RESERVATÓRIO DE FIBRA/FIBROCIMENTO   FORNECIMENTO E INSTALAÇÃO. AF_06/2016","UN",10,null,"BDI 1",0,0,"SEM VALOR",{"$f":"IF(OR($A189=0,$A189=\"S\",$A189>CFF!$A$9),\"\",MAX(V$12:OFFSET(V189,-1,0))+1)","v":""},"SINAPI-94656",{"$error":"#REF!"},4.99,{"$f":"ROUND(IF(ISNUMBER(R189),R189,IF(LEFT(R189,3)=\"BDI\",HLOOKUP(R189,DADOS!$T$37:$X$38,2,FALSE),0)),15-11*$X$5)","v":0.26390000000000002}]
["S",0,14,2,0,0,5,0,0,"Serviço","14.2.5.","SINAPI","94796","TORNEIRA DE BÓIA REAL, ROSCÁVEL, 3/4\", FORNECIDA E INSTALADA EM RESERVAÇÃO DE ÁGUA. AF_06/2016","UN",2,null,"BDI 1",0,0,"SEM VALOR",{"$f":"IF(OR($A190=0,$A190=\"S\",$A190>CFF!$A$9),\"\",MAX(V$12:OFFSET(V190,-1,0))+1)","v":""},"SINAPI-94796",{"$error":"#REF!"},79.11,{"$f":"ROUND(IF(ISNUMBER(R190),R190,IF(LEFT(R190,3)=\"BDI\",HLOOKUP(R190,DADOS!$T$37:$X$38,2,FALSE),0)),15-11*$X$5)","v":0.26390000000000002}]
["S",0,14,2,0,0,6,0,0,"Serviço","14.2.6.","SINAPI","90373","JOELHO 90 GRAUS COM BUCHA DE LATÃO, PVC, SOLDÁVEL, DN 25MM, X 1/2\u0094 INSTALADO EM RAMAL OU SUB-RAMAL DE ÁGUA - FORNECIMENTO E INSTALAÇÃO. AF_12/2014","UN",7,null,"BDI 1",0,0,"SEM VALOR",{"$f":"IF(OR($A191=0,$A191=\"S\",$A191>CFF!$A$9),\"\",MAX(V$12:OFFSET(V191,-1,0))+1)","v":""},"SINAPI-90373",{"$error":"#REF!"},11.3,{"$f":"ROUND(IF(ISNUMBER(R191),R191,IF(LEFT(R191,3)=\"BDI\",HLOOKUP(R191,DADOS!$T$37:$X$38,2,FALSE),0)),15-11*$X$5)","v":0.26390000000000002}]
["S",0,14,2,0,0,7,0,0,"Serviço","14.2.7.","SINAPI","89366","JOELHO 90 GRAUS COM BUCHA DE LATÃO, PVC, SOLDÁVEL, DN 25MM, X 3/4\u0094 INSTALADO EM RAMAL OU SUB-RAMAL DE ÁGUA - FORNECIMENTO E INSTALAÇÃO. AF_12/2014","UN",3,null,"BDI 1",0,0,"SEM VALOR",{"$f":"IF(OR($A192=0,$A192=\"S\",$A192>CFF!$A$9),\"\",MAX(V$12:OFFSET(V192,-1,0))+1)","v":""},"SINAPI-89366",{"$error":"#REF!"},12.21,{"$f":"ROUND(IF(ISNUMBER(R192),R192,IF(LEFT(R192,3)=\"BDI\",HLOOKUP(R192,DADOS!$T$37:$X$38,2,FALSE),0)),15-11*$X$5)","v":0.26390000000000002}]
["S",0,14,2,0,0,8,0,0,"Serviço","14.2.8.","SINAPI-I","11869","CAIXA D'AGUA FIBRA DE VIDRO PARA 1500 LITROS, COM TAMPA","UN",2,null,"BDI 1",0,0,"SEM VALOR",{"$f":"IF(OR($A193=0,$A193=\"S\",$A193>CFF!$A$9),\"\",MAX(V$12:OFFSET(V193,-1,0))+1)","v":""},"SINAPI-I-11869",{"$error":"#REF!"},577.61,{"$f":"ROUND(IF(ISNUMBER(R193),R193,IF(LEFT(R193,3)=\"BDI\",HLOOKUP(R193,DADOS!$T$37:$X$38,2,FALSE),0)),15-11*$X$5)","v":0.26390000000000002}]
["S",0,14,2,0,0,9,0,0,"Serviço","14.2.9.","SINAPI","94490","REGISTRO DE ESFERA, PVC, SOLDÁVEL, DN  32 MM, INSTALADO EM RESERVAÇÃO DE ÁGUA DE EDIFICAÇÃO QUE POSSUA RESERVATÓRIO DE FIBRA/FIBROCIMENTO   FORNECIMENTO E INSTALAÇÃO. AF_06/2016","UN",2,null,"BDI 1",0,0,"SEM VALOR",{"$f":"IF(OR($A194=0,$A194=\"S\",$A194>CFF!$A$9),\"\",MAX(V$12:OFFSET(V194,-1,0))+1)","v":""},"SINAPI-94490",{"$error":"#REF!"},50.42,{"$f":"ROUND(IF(ISNUMBER(R194),R194,IF(LEFT(R194,3)=\"BDI\",HLOOKUP(R194,DADOS!$T$37:$X$38,2,FALSE),0)),15-11*$X$5)","v":0.26390000000000002}]
["S",0,14,2,0,0,10,0,0,"Serviço","14.2.10.","SINAPI","94491","REGISTRO DE ESFERA, PVC, SOLDÁVEL, DN  40 MM, INSTALADO EM RESERVAÇÃO DE ÁGUA DE EDIFICAÇÃO QUE POSSUA RESERVATÓRIO DE FIBRA/FIBROCIMENTO   FORNECIMENTO E INSTALAÇÃO. AF_06/2016","UN",2,null,"BDI 1",0,0,"SEM VALOR",{"$f":"IF(OR($A195=0,$A195=\"S\",$A195>CFF!$A$9),\"\",MAX(V$12:OFFSET(V195,-1,0))+1)","v":""},"SINAPI-94491",{"$error":"#REF!"},68.900000000000006,{"$f":"ROUND(IF(ISNUMBER(R195),R195,IF(LEFT(R195,3)=\"BDI\",HLOOKUP(R195,DADOS!$T$37:$X$38,2,FALSE),0)),15-11*$X$5)","v":0.26390000000000002}]
[1,33,15,0,0,0,0,170,33,"Meta","15.",null,null,"INSTALAÇÃO SANITÁRIA E DRENAGEM PLUVIAL","",0,null,"BDI 1",0,0,"SEM VALOR",{"$f":"IF(OR($A196=0,$A196=\"S\",$A196>CFF!$A$9),\"\",MAX(V$12:OFFSET(V196,-1,0))+1)","v":35},false,"X",0,{"$f":"ROUND(IF(ISNUMBER(R196),R196,IF(LEFT(R196,3)=\"BDI\",HLOOKUP(R196,DADOS!$T$37:$X$38,2,FALSE),0)),15-11*$X$5)","v":0.26390000000000002}]
[2,24,15,1,0,0,0,32,24,"Nível 2","15.1.",null,null,"TUBULAÇÕES E CONEXÕES","",0,null,"BDI 1",0,0,"SEM VALOR",{"$f":"IF(OR($A197=0,$A197=\"S\",$A197>CFF!$A$9),\"\",MAX(V$12:OFFSET(V197,-1,0))+1)","v":36},false,"X",0,{"$f":"ROUND(IF(ISNUMBER(R197),R197,IF(LEFT(R197,3)=\"BDI\",HLOOKUP(R197,DADOS!$T$37:$X$38,2,FALSE),0)),15-11*$X$5)","v":0.26390000000000002}]
["S",0,15,1,0,0,1,0,0,"Serviço","15.1.1.","SINAPI","89714","TUBO PVC, SERIE NORMAL, ESGOTO PREDIAL, DN 100 MM, FORNECIDO E INSTALADO EM RAMAL DE DESCARGA OU RAMAL DE ESGOTO SANITÁRIO. AF_12/2014","M",69.5,null,"BDI 1",0,0,"SEM VALOR",{"$f":"IF(OR($A198=0,$A198=\"S\",$A198>CFF!$A$9),\"\",MAX(V$12:OFFSET(V198,-1,0))+1)","v":""},"SINAPI-89714",{"$error":"#REF!"},44.64,{"$f":"ROUND(IF(ISNUMBER(R198),R198,IF(LEFT(R198,3)=\"BDI\",HLOOKUP(R198,DADOS!$T$37:$X$38,2,FALSE),0)),15-11*$X$5)","v":0.26390000000000002}]
["S",0,15,1,0,0,2,0,0,"Serviço","15.1.2.","SINAPI","89849","TUBO PVC, SERIE NORMAL, ESGOTO PREDIAL, DN 150 MM, FORNECIDO E INSTALADO EM SUBCOLETOR AÉREO DE ESGOTO SANITÁRIO. AF_12/2014","M",18,null,"BDI 1",0,0,"SEM VALOR",{"$f":"IF(OR($A199=0,$A199=\"S\",$A199>CFF!$A$9),\"\",MAX(V$12:OFFSET(V199,-1,0))+1)","v":""},"SINAPI-89849",{"$error":"#REF!"},42.85,{"$f":"ROUND(IF(ISNUMBER(R199),R199,IF(LEFT(R199,3)=\"BDI\",HLOOKUP(R199,DADOS!$T$37:$X$38,2,FALSE),0)),15-11*$X$5)","v":0.26390000000000002}]
["S",0,15,1,0,0,3,0,0,"Serviço","15.1.3.","SINAPI","89711","TUBO PVC, SERIE NORMAL, ESGOTO PREDIAL, DN 40 MM, FORNECIDO E INSTALADO EM RAMAL DE DESCARGA OU RAMAL DE ESGOTO SANITÁRIO. AF_12/2014","M",6.7,null,"BDI 1",0,0,"SEM VALOR",{"$f":"IF(OR($A200=0,$A200=\"S\",$A200>CFF!$A$9),\"\",MAX(V$12:OFFSET(V200,-1,0))+1)","v":""},"SINAPI-89711",{"$error":"#REF!"},15.76,{"$f":"ROUND(IF(ISNUMBER(R200),R200,IF(LEFT(R200,3)=\"BDI\",HLOOKUP(R200,DADOS!$T$37:$X$38,2,FALSE),0)),15-11*$X$5)","v":0.26390000000000002}]
["S",0,15,1,0,0,4,0,0,"Serviço","15.1.4.","SINAPI","89712","TUBO PVC, SERIE NORMAL, ESGOTO PREDIAL, DN 50 MM, FORNECIDO E INSTALADO EM RAMAL DE DESCARGA OU RAMAL DE ESGOTO SANITÁRIO. AF_12/2014","M",17.66,null,"BDI 1",0,0,"SEM VALOR",{"$f":"IF(OR($A201=0,$A201=\"S\",$A201>CFF!$A$9),\"\",MAX(V$12:OFFSET(V201,-1,0))+1)","v":""},"SINAPI-89712",{"$error":"#REF!"},23.27,{"$f":"ROUND(IF(ISNUMBER(R201),R201,IF(LEFT(R201,3)=\"BDI\",HLOOKUP(R201,DADOS!$T$37:$X$38,2,FALSE),0)),15-11*$X$5)","v":0.26390000000000002}]
["S",0,15,1,0,0,5,0,0,"Serviço","15.1.5.","SINAPI","89511","TUBO PVC, SÉRIE R, ÁGUA PLUVIAL, DN 75 MM, FORNECIDO E INSTALADO EM RAMAL DE ENCAMINHAMENTO. AF_12/2014","M",46.8,null,"BDI 1",0,0,"SEM VALOR",{"$f":"IF(OR($A202=0,$A202=\"S\",$A202>CFF!$A$9),\"\",MAX(V$12:OFFSET(V202,-1,0))+1)","v":""},"SINAPI-89511",{"$error":"#REF!"},29.22,{"$f":"ROUND(IF(ISNUMBER(R202),R202,IF(LEFT(R202,3)=\"BDI\",HLOOKUP(R202,DADOS!$T$37:$X$38,2,FALSE),0)),15-11*$X$5)","v":0.26390000000000002}]
["S",0,15,1,0,0,6,0,0,"Serviço","15.1.6.","SINAPI","90696","TUBO DE PVC PARA REDE COLETORA DE ESGOTO DE PAREDE MACIÇA, DN 200 MM, JUNTA ELÁSTICA, INSTALADO EM LOCAL COM NÍVEL BAIXO DE INTERFERÊNCIAS - FORNECIMENTO E ASSENTAMENTO. AF_06/2015","M",12.2,null,"BDI 1",0,0,"SEM VALOR",{"$f":"IF(OR($A203=0,$A203=\"S\",$A203>CFF!$A$9),\"\",MAX(V$12:OFFSET(V203,-1,0))+1)","v":""},"SINAPI-90696",{"$error":"#REF!"},82.07,{"$f":"ROUND(IF(ISNUMBER(R203),R203,IF(LEFT(R203,3)=\"BDI\",HLOOKUP(R203,DADOS!$T$37:$X$38,2,FALSE),0)),15-11*$X$5)","v":0.26390000000000002}]
["S",0,15,1,0,0,7,0,0,"Serviço","15.1.7.","SINAPI","83676","TUBO CONCRETO SIMPLES DN 300 MM PARA DRENAGEM - FORNECIMENTO E INSTALACAO INCLUSIVE ESCAVACAO MANUAL 1M3/M","M",12,null,"BDI 1",0,0,"SEM VALOR",{"$f":"IF(OR($A204=0,$A204=\"S\",$A204>CFF!$A$9),\"\",MAX(V$12:OFFSET(V204,-1,0))+1)","v":""},"SINAPI-83676",{"$error":"#REF!"},123.09,{"$f":"ROUND(IF(ISNUMBER(R204),R204,IF(LEFT(R204,3)=\"BDI\",HLOOKUP(R204,DADOS!$T$37:$X$38,2,FALSE),0)),15-11*$X$5)","v":0.26390000000000002}]
["S",0,15,1,0,0,8,{"$f":"IF(OR($A205=\"S\",$A205=0),0,MATCH(0,OFFSET($B205,1,$A205,ROW($A$366)-ROW($A205)),0))","v":0},{"$f":"IF(OR($A205=\"S\",$A205=0),0,MATCH(OFFSET($B205,0,$A205)+1,OFFSET($B205,1,$A205,ROW($A$366)-ROW($A205)),0))","v":0},"Serviço","15.1.8.","SINAPI-I","1965","CURVA PVC LONGA 45 GRAUS, 100 MM, PARA ESGOTO PREDIAL","UN",2,null,"BDI 1",0,0,"SEM VALOR",{"$f":"IF(OR($A205=0,$A205=\"S\",$A205>CFF!$A$9),\"\",MAX(V$12:OFFSET(V205,-1,0))+1)","v":""},"SINAPI-I-1965",{"$error":"#REF!"},31.52,{"$f":"ROUND(IF(ISNUMBER(R205),R205,IF(LEFT(R205,3)=\"BDI\",HLOOKUP(R205,DADOS!$T$37:$X$38,2,FALSE),0)),15-11*$X$5)","v":0.26390000000000002}]
["S",0,15,1,0,0,9,0,0,"Serviço","15.1.9.","SINAPI","89748","CURVA CURTA 90 GRAUS, PVC, SERIE NORMAL, ESGOTO PREDIAL, DN 100 MM, JUNTA ELÁSTICA, FORNECIDO E INSTALADO EM RAMAL DE DESCARGA OU RAMAL DE ESGOTO SANITÁRIO. AF_12/2014","UN",8,null,"BDI 1",0,0,"SEM VALOR",{"$f":"IF(OR($A206=0,$A206=\"S\",$A206>CFF!$A$9),\"\",MAX(V$12:OFFSET(V206,-1,0))+1)","v":""},"SINAPI-89748",{"$error":"#REF!"},29.66,{"$f":"ROUND(IF(ISNUMBER(R206),R206,IF(LEFT(R206,3)=\"BDI\",HLOOKUP(R206,DADOS!$T$37:$X$38,2,FALSE),0)),15-11*$X$5)","v":0.26390000000000002}]
["S",0,15,1,0,0,10,0,0,"Serviço","15.1.10.","SINAPI","89728","CURVA CURTA 90 GRAUS, PVC, SERIE NORMAL, ESGOTO PREDIAL, DN 40 MM, JUNTA SOLDÁVEL, FORNECIDO E INSTALADO EM RAMAL DE DESCARGA OU RAMAL DE ESGOTO SANITÁRIO. AF_12/2014","UN",7,null,"BDI 1",0,0,"SEM VALOR",{"$f":"IF(OR($A207=0,$A207=\"S\",$A207>CFF!$A$9),\"\",MAX(V$12:OFFSET(V207,-1,0))+1)","v":""},"SINAPI-89728",{"$error":"#REF!"},8.66,{"$f":"ROUND(IF(ISNUMBER(R207),R207,IF(LEFT(R207,3)=\"BDI\",HLOOKUP(R207,DADOS!$T$37:$X$38,2,FALSE),0)),15-11*$X$5)","v":0.26390000000000002}]
["S",0,15,1,0,0,11,0,0,"Serviço","15.1.11.","SINAPI-I","38422","CURVA DE PVC, 90 GRAUS, SERIE R, DN 75 MM, PARA ESGOTO PREDIAL","UN",9,null,"BDI 1",0,0,"SEM VALOR",{"$f":"IF(OR($A208=0,$A208=\"S\",$A208>CFF!$A$9),\"\",MAX(V$12:OFFSET(V208,-1,0))+1)","v":""},"SINAPI-I-38422",{"$error":"#REF!"},26.86,{"$f":"ROUND(IF(ISNUMBER(R208),R208,IF(LEFT(R208,3)=\"BDI\",HLOOKUP(R208,DADOS!$T$37:$X$38,2,FALSE),0)),15-11*$X$5)","v":0.26390000000000002}]
["S",0,15,1,0,0,12,0,0,"Serviço","15.1.12.","SINAPI","89746","JOELHO 45 GRAUS, PVC, SERIE NORMAL, ESGOTO PREDIAL, DN 100 MM, JUNTA ELÁSTICA, FORNECIDO E INSTALADO EM RAMAL DE DESCARGA OU RAMAL DE ESGOTO SANITÁRIO. AF_12/2014","UN",2,null,"BDI 1",0,0,"SEM VALOR",{"$f":"IF(OR($A209=0,$A209=\"S\",$A209>CFF!$A$9),\"\",MAX(V$12:OFFSET(V209,-1,0))+1)","v":""},"SINAPI-89746",{"$error":"#REF!"},18.920000000000002,{"$f":"ROUND(IF(ISNUMBER(R209),R209,IF(LEFT(R209,3)=\"BDI\",HLOOKUP(R209,DADOS!$T$37:$X$38,2,FALSE),0)),15-11*$X$5)","v":0.26390000000000002}]
["S",0,15,1,0,0,13,0,0,"Serviço","15.1.13.","SINAPI","89726","JOELHO 45 GRAUS, PVC, SERIE NORMAL, ESGOTO PREDIAL, DN 40 MM, JUNTA SOLDÁVEL, FORNECIDO E INSTALADO EM RAMAL DE DESCARGA OU RAMAL DE ESGOTO SANITÁRIO. AF_12/2014","UN",3,null,"BDI 1",0,0,"SEM VALOR",{"$f":"IF(OR($A210=0,$A210=\"S\",$A210>CFF!$A$9),\"\",MAX(V$12:OFFSET(V210,-1,0))+1)","v":""},"SINAPI-89726",{"$error":"#REF!"},7.17,{"$f":"ROUND(IF(ISNUMBER(R210),R210,IF(LEFT(R210,3)=\"BDI\",HLOOKUP(R210,DADOS!$T$37:$X$38,2,FALSE),0)),15-11*$X$5)","v":0.26390000000000002}]
["S",0,15,1,0,0,14,0,0,"Serviço","15.1.14.","SINAPI","89732","JOELHO 45 GRAUS, PVC, SERIE NORMAL, ESGOTO PREDIAL, DN 50 MM, JUNTA ELÁSTICA, FORNECIDO E INSTALADO EM RAMAL DE DESCARGA OU RAMAL DE ESGOTO SANITÁRIO. AF_12/2014","UN",7,null,"BDI 1",0,0,"SEM VALOR",{"$f":"IF(OR($A211=0,$A211=\"S\",$A211>CFF!$A$9),\"\",MAX(V$12:OFFSET(V211,-1,0))+1)","v":""},"SINAPI-89732",{"$error":"#REF!"},8.9700000000000006,{"$f":"ROUND(IF(ISNUMBER(R211),R211,IF(LEFT(R211,3)=\"BDI\",HLOOKUP(R211,DADOS!$T$37:$X$38,2,FALSE),0)),15-11*$X$5)","v":0.26390000000000002}]
["S",0,15,1,0,0,15,0,0,"Serviço","15.1.15.","SINAPI","89744","JOELHO 90 GRAUS, PVC, SERIE NORMAL, ESGOTO PREDIAL, DN 100 MM, JUNTA ELÁSTICA, FORNECIDO E INSTALADO EM RAMAL DE DESCARGA OU RAMAL DE ESGOTO SANITÁRIO. AF_12/2014","UN",4,null,"BDI 1",0,0,"SEM VALOR",{"$f":"IF(OR($A212=0,$A212=\"S\",$A212>CFF!$A$9),\"\",MAX(V$12:OFFSET(V212,-1,0))+1)","v":""},"SINAPI-89744",{"$error":"#REF!"},18.86,{"$f":"ROUND(IF(ISNUMBER(R212),R212,IF(LEFT(R212,3)=\"BDI\",HLOOKUP(R212,DADOS!$T$37:$X$38,2,FALSE),0)),15-11*$X$5)","v":0.26390000000000002}]
["S",0,15,1,0,0,16,0,0,"Serviço","15.1.16.","SINAPI","89731","JOELHO 90 GRAUS, PVC, SERIE NORMAL, ESGOTO PREDIAL, DN 50 MM, JUNTA ELÁSTICA, FORNECIDO E INSTALADO EM RAMAL DE DESCARGA OU RAMAL DE ESGOTO SANITÁRIO. AF_12/2014","UN",8,null,"BDI 1",0,0,"SEM VALOR",{"$f":"IF(OR($A213=0,$A213=\"S\",$A213>CFF!$A$9),\"\",MAX(V$12:OFFSET(V213,-1,0))+1)","v":""},"SINAPI-89731",{"$error":"#REF!"},8.39,{"$f":"ROUND(IF(ISNUMBER(R213),R213,IF(LEFT(R213,3)=\"BDI\",HLOOKUP(R213,DADOS!$T$37:$X$38,2,FALSE),0)),15-11*$X$5)","v":0.26390000000000002}]
["S",0,15,1,0,0,17,0,0,"Serviço","15.1.17.","SINAPI","89581","JOELHO 90 GRAUS, PVC, SERIE R, ÁGUA PLUVIAL, DN 75 MM, JUNTA ELÁSTICA, FORNECIDO E INSTALADO EM CONDUTORES VERTICAIS DE ÁGUAS PLUVIAIS. AF_12/2014","UN",9,null,"BDI 1",0,0,"SEM VALOR",{"$f":"IF(OR($A214=0,$A214=\"S\",$A214>CFF!$A$9),\"\",MAX(V$12:OFFSET(V214,-1,0))+1)","v":""},"SINAPI-89581",{"$error":"#REF!"},19.48,{"$f":"ROUND(IF(ISNUMBER(R214),R214,IF(LEFT(R214,3)=\"BDI\",HLOOKUP(R214,DADOS!$T$37:$X$38,2,FALSE),0)),15-11*$X$5)","v":0.26390000000000002}]
["S",0,15,1,0,0,18,0,0,"Serviço","15.1.18.","SINAPI-I","10835","JOELHO PVC, COM BOLSA E ANEL, 90 GRAUS, DN 40 X *38* MM, SERIE NORMAL, PARA ESGOTO PREDIAL","UN",7,null,"BDI 1",0,0,"SEM VALOR",{"$f":"IF(OR($A215=0,$A215=\"S\",$A215>CFF!$A$9),\"\",MAX(V$12:OFFSET(V215,-1,0))+1)","v":""},"SINAPI-I-10835",{"$error":"#REF!"},3.17,{"$f":"ROUND(IF(ISNUMBER(R215),R215,IF(LEFT(R215,3)=\"BDI\",HLOOKUP(R215,DADOS!$T$37:$X$38,2,FALSE),0)),15-11*$X$5)","v":0.26390000000000002}]
["S",0,15,1,0,0,19,0,0,"Serviço","15.1.19.","SINAPI-I","3659","JUNCAO SIMPLES, PVC, DN 100 X 50 MM, SERIE NORMAL PARA ESGOTO PREDIAL","UN",4,null,"BDI 1",0,0,"SEM VALOR",{"$f":"IF(OR($A216=0,$A216=\"S\",$A216>CFF!$A$9),\"\",MAX(V$12:OFFSET(V216,-1,0))+1)","v":""},"SINAPI-I-3659",{"$error":"#REF!"},12.1,{"$f":"ROUND(IF(ISNUMBER(R216),R216,IF(LEFT(R216,3)=\"BDI\",HLOOKUP(R216,DADOS!$T$37:$X$38,2,FALSE),0)),15-11*$X$5)","v":0.26390000000000002}]
["S",0,15,1,0,0,20,0,0,"Serviço","15.1.20.","SINAPI","89797","JUNÇÃO SIMPLES, PVC, SERIE NORMAL, ESGOTO PREDIAL, DN 100 X 100 MM, JUNTA ELÁSTICA, FORNECIDO E INSTALADO EM RAMAL DE DESCARGA OU RAMAL DE ESGOTO SANITÁRIO. AF_12/2014","UN",1,null,"BDI 1",0,0,"SEM VALOR",{"$f":"IF(OR($A217=0,$A217=\"S\",$A217>CFF!$A$9),\"\",MAX(V$12:OFFSET(V217,-1,0))+1)","v":""},"SINAPI-89797",{"$error":"#REF!"},35.26,{"$f":"ROUND(IF(ISNUMBER(R217),R217,IF(LEFT(R217,3)=\"BDI\",HLOOKUP(R217,DADOS!$T$37:$X$38,2,FALSE),0)),15-11*$X$5)","v":0.26390000000000002}]
["S",0,15,1,0,0,21,0,0,"Serviço","15.1.21.","SINAPI","89785","JUNÇÃO SIMPLES, PVC, SERIE NORMAL, ESGOTO PREDIAL, DN 50 X 50 MM, JUNTA ELÁSTICA, FORNECIDO E INSTALADO EM RAMAL DE DESCARGA OU RAMAL DE ESGOTO SANITÁRIO. AF_12/2014","UN",1,null,"BDI 1",0,0,"SEM VALOR",{"$f":"IF(OR($A218=0,$A218=\"S\",$A218>CFF!$A$9),\"\",MAX(V$12:OFFSET(V218,-1,0))+1)","v":""},"SINAPI-89785",{"$error":"#REF!"},15.82,{"$f":"ROUND(IF(ISNUMBER(R218),R218,IF(LEFT(R218,3)=\"BDI\",HLOOKUP(R218,DADOS!$T$37:$X$38,2,FALSE),0)),15-11*$X$5)","v":0.26390000000000002}]
["S",0,15,1,0,0,22,0,0,"Serviço","15.1.22.","SINAPI","89825","TE, PVC, SERIE NORMAL, ESGOTO PREDIAL, DN 50 X 50 MM, JUNTA ELÁSTICA, FORNECIDO E INSTALADO EM PRUMADA DE ESGOTO SANITÁRIO OU VENTILAÇÃO. AF_12/2014","UN",6,null,"BDI 1",0,0,"SEM VALOR",{"$f":"IF(OR($A219=0,$A219=\"S\",$A219>CFF!$A$9),\"\",MAX(V$12:OFFSET(V219,-1,0))+1)","v":""},"SINAPI-89825",{"$error":"#REF!"},10.76,{"$f":"ROUND(IF(ISNUMBER(R219),R219,IF(LEFT(R219,3)=\"BDI\",HLOOKUP(R219,DADOS!$T$37:$X$38,2,FALSE),0)),15-11*$X$5)","v":0.26390000000000002}]
["S",0,15,1,0,0,23,0,0,"Serviço","15.1.23.","SINAPI","89673","REDUÇÃO EXCÊNTRICA, PVC, SERIE R, ÁGUA PLUVIAL, DN 100 X 75 MM, JUNTA ELÁSTICA, FORNECIDO E INSTALADO EM CONDUTORES VERTICAIS DE ÁGUAS PLUVIAIS. AF_12/2014","UN",6,null,"BDI 1",0,0,"SEM VALOR",{"$f":"IF(OR($A220=0,$A220=\"S\",$A220>CFF!$A$9),\"\",MAX(V$12:OFFSET(V220,-1,0))+1)","v":""},"SINAPI-89673",{"$error":"#REF!"},18.96,{"$f":"ROUND(IF(ISNUMBER(R220),R220,IF(LEFT(R220,3)=\"BDI\",HLOOKUP(R220,DADOS!$T$37:$X$38,2,FALSE),0)),15-11*$X$5)","v":0.26390000000000002}]
[2,8,15,2,0,0,0,8,15,"Nível 2","15.2.",null,null,"ACESSÓRIOS E COMPLEMENTOS","",0,null,"BDI 1",0,0,"SEM VALOR",{"$f":"IF(OR($A221=0,$A221=\"S\",$A221>CFF!$A$9),\"\",MAX(V$12:OFFSET(V221,-1,0))+1)","v":37},false,"X",0,{"$f":"ROUND(IF(ISNUMBER(R221),R221,IF(LEFT(R221,3)=\"BDI\",HLOOKUP(R221,DADOS!$T$37:$X$38,2,FALSE),0)),15-11*$X$5)","v":0.26390000000000002}]
["S",0,15,2,0,0,1,0,0,"Serviço","15.2.1.","COMP.","018","CAIXA SIFONADA, PVC, DN 150 X 150 X 50 MM, JUNTA ELÁSTICA, FORNECIDA E INSTALADA EM RAMAL DE DESCARGA OU EM RAMAL DE ESGOTO SANITÁRIO","UN",5,null,"BDI 1",0,0,"SEM VALOR",{"$f":"IF(OR($A222=0,$A222=\"S\",$A222>CFF!$A$9),\"\",MAX(V$12:OFFSET(V222,-1,0))+1)","v":""},"COMP.-018",{"$error":"#REF!"},47.7,{"$f":"ROUND(IF(ISNUMBER(R222),R222,IF(LEFT(R222,3)=\"BDI\",HLOOKUP(R222,DADOS!$T$37:$X$38,2,FALSE),0)),15-11*$X$5)","v":0.26390000000000002}]
["S",0,15,2,0,0,2,0,0,"Serviço","15.2.2.","SINAPI","97902","CAIXA ENTERRADA HIDRÁULICA RETANGULAR EM ALVENARIA COM TIJOLOS CERÂMICOS MACIÇOS, DIMENSÕES INTERNAS: 0,6X0,6X0,6 M PARA REDE DE ESGOTO. AF_05/2018","UN",8,null,"BDI 1",0,0,"SEM VALOR",{"$f":"IF(OR($A223=0,$A223=\"S\",$A223>CFF!$A$9),\"\",MAX(V$12:OFFSET(V223,-1,0))+1)","v":""},"SINAPI-97902",{"$error":"#REF!"},498.34,{"$f":"ROUND(IF(ISNUMBER(R223),R223,IF(LEFT(R223,3)=\"BDI\",HLOOKUP(R223,DADOS!$T$37:$X$38,2,FALSE),0)),15-11*$X$5)","v":0.26390000000000002}]
[{"$f":"CHOOSE(1+LOG(1+2*(J224=\"Meta\")+4*(J224=\"Nível 2\")+8*(J224=\"Nível 3\")+16*(J224=\"Nível 4\")+32*(J224=\"Serviço\"),2),0,1,2,3,4,\"S\")","v":"S"},{"$f":"IF(OR(A224=\"S\",A224=0),0,IF(ISERROR(I224),H224,SMALL(H224:I224,1)))","v":0},15,2,0,0,3,0,0,"Serviço",{"$f":"IF($A224=0,\"-\",CONCATENATE(C224&\".\",IF(AND($A$5>=2,$A224>=2),D224&\".\",\"\"),IF(AND($A$5>=3,$A224>=3),E224&\".\",\"\"),IF(AND($A$5>=4,$A224>=4),F224&\".\",\"\"),IF($A224=\"S\",G224&\".\",\"\")))","v":"15.2.3."},"COMP.","032","CAIXA DE AREIA ENTERRADA RETANGULAR EM ALVENARIA COM TIJOLOS CERÂMICOS MACIÇOS, DIMENSÕES INTERNAS: 0,6X0,6X0,6 M PARA REDE PLUVIAL COM GRADE","UN",4,null,"BDI 1",0,0,"SEM VALOR",{"$f":"IF(OR($A224=0,$A224=\"S\",$A224>CFF!$A$9),\"\",MAX(V$12:OFFSET(V224,-1,0))+1)","v":""},"COMP.-032",{"$error":"#REF!"},528.61,{"$f":"ROUND(IF(ISNUMBER(R224),R224,IF(LEFT(R224,3)=\"BDI\",HLOOKUP(R224,DADOS!$T$37:$X$38,2,FALSE),0)),15-11*$X$5)","v":0.26390000000000002}]
["S",0,15,2,0,0,4,0,0,"Serviço","15.2.4.","SINAPI","98110","CAIXA DE GORDURA PEQUENA (CAPACIDADE: 19 L), CIRCULAR, EM PVC, DIÂMETRO INTERNO= 0,3 M. AF_05/2018","UN",1,null,"BDI 1",0,0,"SEM VALOR",{"$f":"IF(OR($A225=0,$A225=\"S\",$A225>CFF!$A$9),\"\",MAX(V$12:OFFSET(V225,-1,0))+1)","v":""},"SINAPI-98110",{"$error":"#REF!"},465.58,{"$f":"ROUND(IF(ISNUMBER(R225),R225,IF(LEFT(R225,3)=\"BDI\",HLOOKUP(R225,DADOS!$T$37:$X$38,2,FALSE),0)),15-11*$X$5)","v":0.26390000000000002}]
["S",0,15,2,0,0,5,0,0,"Serviço","15.2.5.","COMP.","033","TANQUE SÉPTICO CIRCULAR, EM CONCRETO PRÉ-MOLDADO, DIÂMETRO INTERNO = 1,40 M, ALTURA INTERNA = 2,50 M, VOLUME ÚTIL: 3463,6 L (PARA 13 CONTRIBUINTES), INCLUSIVE TUBULAÇÕES E CONEXÕES","UN",1,null,"BDI 1",0,0,"SEM VALOR",{"$f":"IF(OR($A226=0,$A226=\"S\",$A226>CFF!$A$9),\"\",MAX(V$12:OFFSET(V226,-1,0))+1)","v":""},"COMP.-033",{"$error":"#REF!"},2351.23,{"$f":"ROUND(IF(ISNUMBER(R226),R226,IF(LEFT(R226,3)=\"BDI\",HLOOKUP(R226,DADOS!$T$37:$X$38,2,FALSE),0)),15-11*$X$5)","v":0.26390000000000002}]
["S",0,15,2,0,0,6,0,0,"Serviço","15.2.6.","COMP.","031","SUMIDOURO CIRCULAR, EM CONCRETO PRÉ-MOLDADO, DIÂMETRO INTERNO = 2,38 M, ALTURA INTERNA = 3,0 M, ÁREA DE INFILTRAÇÃO: 25 M² (PARA 10 CONTRIBUINTES)","UN",1,null,"BDI 1",0,0,"SEM VALOR",{"$f":"IF(OR($A227=0,$A227=\"S\",$A227>CFF!$A$9),\"\",MAX(V$12:OFFSET(V227,-1,0))+1)","v":""},"COMP.-031",{"$error":"#REF!"},2357.5100000000002,{"$f":"ROUND(IF(ISNUMBER(R227),R227,IF(LEFT(R227,3)=\"BDI\",HLOOKUP(R227,DADOS!$T$37:$X$38,2,FALSE),0)),15-11*$X$5)","v":0.26390000000000002}]
["S",0,15,2,0,0,7,0,0,"Serviço","15.2.7.","SINAPI-I","39319","TERMINAL DE VENTILACAO, 50 MM, SERIE NORMAL, ESGOTO PREDIAL","UN",2,null,"BDI 1",0,0,"SEM VALOR",{"$f":"IF(OR($A228=0,$A228=\"S\",$A228>CFF!$A$9),\"\",MAX(V$12:OFFSET(V228,-1,0))+1)","v":""},"SINAPI-I-39319",{"$error":"#REF!"},4.47,{"$f":"ROUND(IF(ISNUMBER(R228),R228,IF(LEFT(R228,3)=\"BDI\",HLOOKUP(R228,DADOS!$T$37:$X$38,2,FALSE),0)),15-11*$X$5)","v":0.26390000000000002}]
[1,39,16,0,0,0,0,137,39,"Meta","16.",null,null,"INSTALAÇÕES ELÉTRICAS","",0,null,"BDI 1",0,0,"SEM VALOR",{"$f":"IF(OR($A229=0,$A229=\"S\",$A229>CFF!$A$9),\"\",MAX(V$12:OFFSET(V229,-1,0))+1)","v":38},false,"X",0,{"$f":"ROUND(IF(ISNUMBER(R229),R229,IF(LEFT(R229,3)=\"BDI\",HLOOKUP(R229,DADOS!$T$37:$X$38,2,FALSE),0)),15-11*$X$5)","v":0.26390000000000002}]
[2,2,16,1,0,0,0,38,2,"Nível 2","16.1.",null,null,"CENTRO DE DISTRIBUIÇÃO","",0,null,"BDI 1",0,0,"SEM VALOR",{"$f":"IF(OR($A230=0,$A230=\"S\",$A230>CFF!$A$9),\"\",MAX(V$12:OFFSET(V230,-1,0))+1)","v":39},false,"X",0,{"$f":"ROUND(IF(ISNUMBER(R230),R230,IF(LEFT(R230,3)=\"BDI\",HLOOKUP(R230,DADOS!$T$37:$X$38,2,FALSE),0)),15-11*$X$5)","v":0.26390000000000002}]
["S",0,16,1,0,0,1,0,0,"Serviço","16.1.1.","SINAPI","74131/7","QUADRO DE DISTRIBUICAO DE ENERGIA DE EMBUTIR, EM CHAPA METALICA, PARA 40 DISJUNTORES TERMOMAGNETICOS MONOPOLARES, COM BARRAMENTO TRIFASICO E NEUTRO, FORNECIMENTO E INSTALACAO","UN",1,null,"BDI 1",0,0,"SEM VALOR",{"$f":"IF(OR($A231=0,$A231=\"S\",$A231>CFF!$A$9),\"\",MAX(V$12:OFFSET(V231,-1,0))+1)","v":""},"SINAPI-74131/7",{"$error":"#REF!"},964.62,{"$f":"ROUND(IF(ISNUMBER(R231),R231,IF(LEFT(R231,3)=\"BDI\",HLOOKUP(R231,DADOS!$T$37:$X$38,2,FALSE),0)),15-11*$X$5)","v":0.26390000000000002}]
[2,4,16,2,0,0,0,36,4,"Nível 2","16.2.",null,null,"ELETRODUTOS E ACESSÓRIOS","",0,null,"BDI 1",0,0,"SEM VALOR",{"$f":"IF(OR($A232=0,$A232=\"S\",$A232>CFF!$A$9),\"\",MAX(V$12:OFFSET(V232,-1,0))+1)","v":40},false,"X",0,{"$f":"ROUND(IF(ISNUMBER(R232),R232,IF(LEFT(R232,3)=\"BDI\",HLOOKUP(R232,DADOS!$T$37:$X$38,2,FALSE),0)),15-11*$X$5)","v":0.26390000000000002}]
["S",0,16,2,0,0,1,0,0,"Serviço","16.2.1.","SINAPI","91854","ELETRODUTO FLEXÍVEL CORRUGADO, PVC, DN 25 MM (3/4\"), PARA CIRCUITOS TERMINAIS, INSTALADO EM PAREDE - FORNECIMENTO E INSTALAÇÃO. AF_12/2015","M",320,null,"BDI 1",0,0,"SEM VALOR",{"$f":"IF(OR($A233=0,$A233=\"S\",$A233>CFF!$A$9),\"\",MAX(V$12:OFFSET(V233,-1,0))+1)","v":""},"SINAPI-91854",{"$error":"#REF!"},7.36,{"$f":"ROUND(IF(ISNUMBER(R233),R233,IF(LEFT(R233,3)=\"BDI\",HLOOKUP(R233,DADOS!$T$37:$X$38,2,FALSE),0)),15-11*$X$5)","v":0.26390000000000002}]
["S",0,16,2,0,0,2,0,0,"Serviço","16.2.2.","SINAPI","91869","ELETRODUTO RÍGIDO ROSCÁVEL, PVC, DN 40 MM (1 1/4\"), PARA CIRCUITOS TERMINAIS, INSTALADO EM LAJE - FORNECIMENTO E INSTALAÇÃO. AF_12/2015","M",30,null,"BDI 1",0,0,"SEM VALOR",{"$f":"IF(OR($A234=0,$A234=\"S\",$A234>CFF!$A$9),\"\",MAX(V$12:OFFSET(V234,-1,0))+1)","v":""},"SINAPI-91869",{"$error":"#REF!"},13.26,{"$f":"ROUND(IF(ISNUMBER(R234),R234,IF(LEFT(R234,3)=\"BDI\",HLOOKUP(R234,DADOS!$T$37:$X$38,2,FALSE),0)),15-11*$X$5)","v":0.26390000000000002}]
["S",0,16,2,0,0,3,0,0,"Serviço","16.2.3.","SINAPI","83446","CAIXA DE PASSAGEM 30X30X40 COM TAMPA E DRENO BRITA","UN",4,null,"BDI 1",0,0,"SEM VALOR",{"$f":"IF(OR($A235=0,$A235=\"S\",$A235>CFF!$A$9),\"\",MAX(V$12:OFFSET(V235,-1,0))+1)","v":""},"SINAPI-83446",{"$error":"#REF!"},176.16,{"$f":"ROUND(IF(ISNUMBER(R235),R235,IF(LEFT(R235,3)=\"BDI\",HLOOKUP(R235,DADOS!$T$37:$X$38,2,FALSE),0)),15-11*$X$5)","v":0.26390000000000002}]
[2,6,16,3,0,0,0,32,6,"Nível 2","16.3.",null,null,"DISPOSITIVOS DE PROTEÇÃO","",0,null,"BDI 1",0,0,"SEM VALOR",{"$f":"IF(OR($A236=0,$A236=\"S\",$A236>CFF!$A$9),\"\",MAX(V$12:OFFSET(V236,-1,0))+1)","v":41},false,"X",0,{"$f":"ROUND(IF(ISNUMBER(R236),R236,IF(LEFT(R236,3)=\"BDI\",HLOOKUP(R236,DADOS!$T$37:$X$38,2,FALSE),0)),15-11*$X$5)","v":0.26390000000000002}]
["S",0,16,3,0,0,1,0,0,"Serviço","16.3.1.","SINAPI","93673","DISJUNTOR TRIPOLAR TIPO DIN, CORRENTE NOMINAL DE 50A - FORNECIMENTO E INSTALAÇÃO. AF_04/2016","UN",1,null,"BDI 1",0,0,"SEM VALOR",{"$f":"IF(OR($A237=0,$A237=\"S\",$A237>CFF!$A$9),\"\",MAX(V$12:OFFSET(V237,-1,0))+1)","v":""},"SINAPI-93673",{"$error":"#REF!"},99.89,{"$f":"ROUND(IF(ISNUMBER(R237),R237,IF(LEFT(R237,3)=\"BDI\",HLOOKUP(R237,DADOS!$T$37:$X$38,2,FALSE),0)),15-11*$X$5)","v":0.26390000000000002}]
["S",0,16,3,0,0,2,0,0,"Serviço","16.3.2.","SINAPI","93653","DISJUNTOR MONOPOLAR TIPO DIN, CORRENTE NOMINAL DE 10A - FORNECIMENTO E INSTALAÇÃO. AF_04/2016","UN",14,null,"BDI 1",0,0,"SEM VALOR",{"$f":"IF(OR($A238=0,$A238=\"S\",$A238>CFF!$A$9),\"\",MAX(V$12:OFFSET(V238,-1,0))+1)","v":""},"SINAPI-93653",{"$error":"#REF!"},12.56,{"$f":"ROUND(IF(ISNUMBER(R238),R238,IF(LEFT(R238,3)=\"BDI\",HLOOKUP(R238,DADOS!$T$37:$X$38,2,FALSE),0)),15-11*$X$5)","v":0.26390000000000002}]
["S",0,16,3,0,0,3,0,0,"Serviço","16.3.3.","SINAPI","93654","DISJUNTOR MONOPOLAR TIPO DIN, CORRENTE NOMINAL DE 16A - FORNECIMENTO E INSTALAÇÃO. AF_04/2016","UN",5,null,"BDI 1",0,0,"SEM VALOR",{"$f":"IF(OR($A239=0,$A239=\"S\",$A239>CFF!$A$9),\"\",MAX(V$12:OFFSET(V239,-1,0))+1)","v":""},"SINAPI-93654",{"$error":"#REF!"},13.06,{"$f":"ROUND(IF(ISNUMBER(R239),R239,IF(LEFT(R239,3)=\"BDI\",HLOOKUP(R239,DADOS!$T$37:$X$38,2,FALSE),0)),15-11*$X$5)","v":0.26390000000000002}]
["S",0,16,3,0,0,4,0,0,"Serviço","16.3.4.","SINAPI-I","39472","DISPOSITIVO DPS CLASSE II, 1 POLO, TENSAO MAXIMA DE 275 V, CORRENTE MAXIMA DE *90* KA (TIPO AC)","UN",4,null,"BDI 1",0,0,"SEM VALOR",{"$f":"IF(OR($A240=0,$A240=\"S\",$A240>CFF!$A$9),\"\",MAX(V$12:OFFSET(V240,-1,0))+1)","v":""},"SINAPI-I-39472",{"$error":"#REF!"},210.22,{"$f":"ROUND(IF(ISNUMBER(R240),R240,IF(LEFT(R240,3)=\"BDI\",HLOOKUP(R240,DADOS!$T$37:$X$38,2,FALSE),0)),15-11*$X$5)","v":0.26390000000000002}]
["S",0,16,3,0,0,5,0,0,"Serviço","16.3.5.","SINAPI-I","39445","DISPOSITIVO DR, 2 POLOS, SENSIBILIDADE DE 30 MA, CORRENTE DE 25 A, TIPO AC","UN",3,null,"BDI 1",0,0,"SEM VALOR",{"$f":"IF(OR($A241=0,$A241=\"S\",$A241>CFF!$A$9),\"\",MAX(V$12:OFFSET(V241,-1,0))+1)","v":""},"SINAPI-I-39445",{"$error":"#REF!"},161.83000000000001,{"$f":"ROUND(IF(ISNUMBER(R241),R241,IF(LEFT(R241,3)=\"BDI\",HLOOKUP(R241,DADOS!$T$37:$X$38,2,FALSE),0)),15-11*$X$5)","v":0.26390000000000002}]
[2,5,16,4,0,0,0,26,5,"Nível 2","16.4.",null,null,"CABOS E FIOS","",0,null,"BDI 1",0,0,"SEM VALOR",{"$f":"IF(OR($A242=0,$A242=\"S\",$A242>CFF!$A$9),\"\",MAX(V$12:OFFSET(V242,-1,0))+1)","v":42},false,"X",0,{"$f":"ROUND(IF(ISNUMBER(R242),R242,IF(LEFT(R242,3)=\"BDI\",HLOOKUP(R242,DADOS!$T$37:$X$38,2,FALSE),0)),15-11*$X$5)","v":0.26390000000000002}]
["S",0,16,4,0,0,1,0,0,"Serviço","16.4.1.","SINAPI","91924","CABO DE COBRE FLEXÍVEL ISOLADO, 1,5 MM², ANTI-CHAMA 450/750 V, PARA CIRCUITOS TERMINAIS - FORNECIMENTO E INSTALAÇÃO. AF_12/2015","M",105.5,null,"BDI 1",0,0,"SEM VALOR",{"$f":"IF(OR($A243=0,$A243=\"S\",$A243>CFF!$A$9),\"\",MAX(V$12:OFFSET(V243,-1,0))+1)","v":""},"SINAPI-91924",{"$error":"#REF!"},2.0699999999999998,{"$f":"ROUND(IF(ISNUMBER(R243),R243,IF(LEFT(R243,3)=\"BDI\",HLOOKUP(R243,DADOS!$T$37:$X$38,2,FALSE),0)),15-11*$X$5)","v":0.26390000000000002}]
["S",0,16,4,0,0,2,0,0,"Serviço","16.4.2.","SINAPI","91926","CABO DE COBRE FLEXÍVEL ISOLADO, 2,5 MM², ANTI-CHAMA 450/750 V, PARA CIRCUITOS TERMINAIS - FORNECIMENTO E INSTALAÇÃO. AF_12/2015","M",1035.5,null,"BDI 1",0,0,"SEM VALOR",{"$f":"IF(OR($A244=0,$A244=\"S\",$A244>CFF!$A$9),\"\",MAX(V$12:OFFSET(V244,-1,0))+1)","v":""},"SINAPI-91926",{"$error":"#REF!"},3.07,{"$f":"ROUND(IF(ISNUMBER(R244),R244,IF(LEFT(R244,3)=\"BDI\",HLOOKUP(R244,DADOS!$T$37:$X$38,2,FALSE),0)),15-11*$X$5)","v":0.26390000000000002}]
["S",0,16,4,0,0,3,0,0,"Serviço","16.4.3.","SINAPI","91928","CABO DE COBRE FLEXÍVEL ISOLADO, 4 MM², ANTI-CHAMA 450/750 V, PARA CIRCUITOS TERMINAIS - FORNECIMENTO E INSTALAÇÃO. AF_12/2015","M",292.5,null,"BDI 1",0,0,"SEM VALOR",{"$f":"IF(OR($A245=0,$A245=\"S\",$A245>CFF!$A$9),\"\",MAX(V$12:OFFSET(V245,-1,0))+1)","v":""},"SINAPI-91928",{"$error":"#REF!"},4.95,{"$f":"ROUND(IF(ISNUMBER(R245),R245,IF(LEFT(R245,3)=\"BDI\",HLOOKUP(R245,DADOS!$T$37:$X$38,2,FALSE),0)),15-11*$X$5)","v":0.26390000000000002}]
["S",0,16,4,0,0,4,0,0,"Serviço","16.4.4.","SINAPI","91932","CABO DE COBRE FLEXÍVEL ISOLADO, 10 MM², ANTI-CHAMA 450/750 V, PARA CIRCUITOS TERMINAIS - FORNECIMENTO E INSTALAÇÃO. AF_12/2015","M",95.5,null,"BDI 1",0,0,"SEM VALOR",{"$f":"IF(OR($A246=0,$A246=\"S\",$A246>CFF!$A$9),\"\",MAX(V$12:OFFSET(V246,-1,0))+1)","v":""},"SINAPI-91932",{"$error":"#REF!"},11.13,{"$f":"ROUND(IF(ISNUMBER(R246),R246,IF(LEFT(R246,3)=\"BDI\",HLOOKUP(R246,DADOS!$T$37:$X$38,2,FALSE),0)),15-11*$X$5)","v":0.26390000000000002}]
[2,21,16,5,0,0,0,21,{"$error":"#N/A"},"Nível 2","16.5.",null,null,"ILUMINAÇÃO E TOMADAS","",0,null,"BDI 1",0,0,"SEM VALOR",{"$f":"IF(OR($A247=0,$A247=\"S\",$A247>CFF!$A$9),\"\",MAX(V$12:OFFSET(V247,-1,0))+1)","v":43},false,"X",0,{"$f":"ROUND(IF(ISNUMBER(R247),R247,IF(LEFT(R247,3)=\"BDI\",HLOOKUP(R247,DADOS!$T$37:$X$38,2,FALSE),0)),15-11*$X$5)","v":0.26390000000000002}]
["S",0,16,5,0,0,1,0,0,"Serviço","16.5.1.","SINAPI","91941","CAIXA RETANGULAR 4\" X 2\" BAIXA (0,30 M DO PISO), PVC, INSTALADA EM PAREDE - FORNECIMENTO E INSTALAÇÃO. AF_12/2015","UN",36,null,"BDI 1",0,0,"SEM VALOR",{"$f":"IF(OR($A248=0,$A248=\"S\",$A248>CFF!$A$9),\"\",MAX(V$12:OFFSET(V248,-1,0))+1)","v":""},"SINAPI-91941",{"$error":"#REF!"},8.14,{"$f":"ROUND(IF(ISNUMBER(R248),R248,IF(LEFT(R248,3)=\"BDI\",HLOOKUP(R248,DADOS!$T$37:$X$38,2,FALSE),0)),15-11*$X$5)","v":0.26390000000000002}]
["S",0,16,5,0,0,2,0,0,"Serviço","16.5.2.","SINAPI","92016","TOMADA BAIXA DE EMBUTIR (3 MÓDULOS), 2P+T 10 A, INCLUINDO SUPORTE E PLACA - FORNECIMENTO E INSTALAÇÃO. AF_12/2015","UN",4,null,"BDI 1",0,0,"SEM VALOR",{"$f":"IF(OR($A249=0,$A249=\"S\",$A249>CFF!$A$9),\"\",MAX(V$12:OFFSET(V249,-1,0))+1)","v":""},"SINAPI-92016",{"$error":"#REF!"},55.02,{"$f":"ROUND(IF(ISNUMBER(R249),R249,IF(LEFT(R249,3)=\"BDI\",HLOOKUP(R249,DADOS!$T$37:$X$38,2,FALSE),0)),15-11*$X$5)","v":0.26390000000000002}]
["S",0,16,5,0,0,3,0,0,"Serviço","16.5.3.","SINAPI","92000","TOMADA BAIXA DE EMBUTIR (1 MÓDULO), 2P+T 10 A, INCLUINDO SUPORTE E PLACA - FORNECIMENTO E INSTALAÇÃO. AF_12/2015","UN",32,null,"BDI 1",0,0,"SEM VALOR",{"$f":"IF(OR($A250=0,$A250=\"S\",$A250>CFF!$A$9),\"\",MAX(V$12:OFFSET(V250,-1,0))+1)","v":""},"SINAPI-92000",{"$error":"#REF!"},24.86,{"$f":"ROUND(IF(ISNUMBER(R250),R250,IF(LEFT(R250,3)=\"BDI\",HLOOKUP(R250,DADOS!$T$37:$X$38,2,FALSE),0)),15-11*$X$5)","v":0.26390000000000002}]
["S",0,16,5,0,0,4,0,0,"Serviço","16.5.4.","SINAPI","91940","CAIXA RETANGULAR 4\" X 2\" MÉDIA (1,30 M DO PISO), PVC, INSTALADA EM PAREDE - FORNECIMENTO E INSTALAÇÃO. AF_12/2015","UN",22,null,"BDI 1",0,0,"SEM VALOR",{"$f":"IF(OR($A251=0,$A251=\"S\",$A251>CFF!$A$9),\"\",MAX(V$12:OFFSET(V251,-1,0))+1)","v":""},"SINAPI-91940",{"$error":"#REF!"},12.06,{"$f":"ROUND(IF(ISNUMBER(R251),R251,IF(LEFT(R251,3)=\"BDI\",HLOOKUP(R251,DADOS!$T$37:$X$38,2,FALSE),0)),15-11*$X$5)","v":0.26390000000000002}]
["S",0,16,5,0,0,5,0,0,"Serviço","16.5.5.","SINAPI","91996","TOMADA MÉDIA DE EMBUTIR (1 MÓDULO), 2P+T 10 A, INCLUINDO SUPORTE E PLACA - FORNECIMENTO E INSTALAÇÃO. AF_12/2015","UN",7,null,"BDI 1",0,0,"SEM VALOR",{"$f":"IF(OR($A252=0,$A252=\"S\",$A252>CFF!$A$9),\"\",MAX(V$12:OFFSET(V252,-1,0))+1)","v":""},"SINAPI-91996",{"$error":"#REF!"},27.65,{"$f":"ROUND(IF(ISNUMBER(R252),R252,IF(LEFT(R252,3)=\"BDI\",HLOOKUP(R252,DADOS!$T$37:$X$38,2,FALSE),0)),15-11*$X$5)","v":0.26390000000000002}]
["S",0,16,5,0,0,6,0,0,"Serviço","16.5.6.","SINAPI","91939","CAIXA RETANGULAR 4\" X 2\" ALTA (2,00 M DO PISO), PVC, INSTALADA EM PAREDE - FORNECIMENTO E INSTALAÇÃO. AF_12/2015","UN",14,null,"BDI 1",0,0,"SEM VALOR",{"$f":"IF(OR($A253=0,$A253=\"S\",$A253>CFF!$A$9),\"\",MAX(V$12:OFFSET(V253,-1,0))+1)","v":""},"SINAPI-91939",{"$error":"#REF!"},22.5,{"$f":"ROUND(IF(ISNUMBER(R253),R253,IF(LEFT(R253,3)=\"BDI\",HLOOKUP(R253,DADOS!$T$37:$X$38,2,FALSE),0)),15-11*$X$5)","v":0.26390000000000002}]
["S",0,16,5,0,0,7,0,0,"Serviço","16.5.7.","SINAPI","91992","TOMADA ALTA DE EMBUTIR (1 MÓDULO), 2P+T 10 A, INCLUINDO SUPORTE E PLACA - FORNECIMENTO E INSTALAÇÃO. AF_12/2015","UN",10,null,"BDI 1",0,0,"SEM VALOR",{"$f":"IF(OR($A254=0,$A254=\"S\",$A254>CFF!$A$9),\"\",MAX(V$12:OFFSET(V254,-1,0))+1)","v":""},"SINAPI-91992",{"$error":"#REF!"},34.880000000000003,{"$f":"ROUND(IF(ISNUMBER(R254),R254,IF(LEFT(R254,3)=\"BDI\",HLOOKUP(R254,DADOS!$T$37:$X$38,2,FALSE),0)),15-11*$X$5)","v":0.26390000000000002}]
["S",0,16,5,0,0,8,0,0,"Serviço","16.5.8.","SINAPI","92023","INTERRUPTOR SIMPLES (1 MÓDULO) COM 1 TOMADA DE EMBUTIR 2P+T 10 A,  INCLUINDO SUPORTE E PLACA - FORNECIMENTO E INSTALAÇÃO. AF_12/2015","UN",5,null,"BDI 1",0,0,"SEM VALOR",{"$f":"IF(OR($A255=0,$A255=\"S\",$A255>CFF!$A$9),\"\",MAX(V$12:OFFSET(V255,-1,0))+1)","v":""},"SINAPI-92023",{"$error":"#REF!"},41.34,{"$f":"ROUND(IF(ISNUMBER(R255),R255,IF(LEFT(R255,3)=\"BDI\",HLOOKUP(R255,DADOS!$T$37:$X$38,2,FALSE),0)),15-11*$X$5)","v":0.26390000000000002}]
["S",0,16,5,0,0,9,0,0,"Serviço","16.5.9.","SINAPI","91957","INTERRUPTOR SIMPLES (1 MÓDULO) COM INTERRUPTOR PARALELO (1 MÓDULO), 10A/250V, INCLUINDO SUPORTE E PLACA - FORNECIMENTO E INSTALAÇÃO. AF_12/2015","UN",1,null,"BDI 1",0,0,"SEM VALOR",{"$f":"IF(OR($A256=0,$A256=\"S\",$A256>CFF!$A$9),\"\",MAX(V$12:OFFSET(V256,-1,0))+1)","v":""},"SINAPI-91957",{"$error":"#REF!"},42.57,{"$f":"ROUND(IF(ISNUMBER(R256),R256,IF(LEFT(R256,3)=\"BDI\",HLOOKUP(R256,DADOS!$T$37:$X$38,2,FALSE),0)),15-11*$X$5)","v":0.26390000000000002}]
["S",0,16,5,0,0,10,0,0,"Serviço","16.5.10.","SINAPI","91961","INTERRUPTOR PARALELO (2 MÓDULOS), 10A/250V, INCLUINDO SUPORTE E PLACA - FORNECIMENTO E INSTALAÇÃO. AF_12/2015","UN",1,null,"BDI 1",0,0,"SEM VALOR",{"$f":"IF(OR($A257=0,$A257=\"S\",$A257>CFF!$A$9),\"\",MAX(V$12:OFFSET(V257,-1,0))+1)","v":""},"SINAPI-91961",{"$error":"#REF!"},47.99,{"$f":"ROUND(IF(ISNUMBER(R257),R257,IF(LEFT(R257,3)=\"BDI\",HLOOKUP(R257,DADOS!$T$37:$X$38,2,FALSE),0)),15-11*$X$5)","v":0.26390000000000002}]
["S",0,16,5,0,0,11,0,0,"Serviço","16.5.11.","SINAPI","91955","INTERRUPTOR PARALELO (1 MÓDULO), 10A/250V, INCLUINDO SUPORTE E PLACA - FORNECIMENTO E INSTALAÇÃO. AF_12/2015","UN",3,null,"BDI 1",0,0,"SEM VALOR",{"$f":"IF(OR($A258=0,$A258=\"S\",$A258>CFF!$A$9),\"\",MAX(V$12:OFFSET(V258,-1,0))+1)","v":""},"SINAPI-91955",{"$error":"#REF!"},28.88,{"$f":"ROUND(IF(ISNUMBER(R258),R258,IF(LEFT(R258,3)=\"BDI\",HLOOKUP(R258,DADOS!$T$37:$X$38,2,FALSE),0)),15-11*$X$5)","v":0.26390000000000002}]
["S",0,16,5,0,0,12,0,0,"Serviço","16.5.12.","SINAPI","91953","INTERRUPTOR SIMPLES (1 MÓDULO), 10A/250V, INCLUINDO SUPORTE E PLACA - FORNECIMENTO E INSTALAÇÃO. AF_12/2015","UN",5,null,"BDI 1",0,0,"SEM VALOR",{"$f":"IF(OR($A259=0,$A259=\"S\",$A259>CFF!$A$9),\"\",MAX(V$12:OFFSET(V259,-1,0))+1)","v":""},"SINAPI-91953",{"$error":"#REF!"},23.47,{"$f":"ROUND(IF(ISNUMBER(R259),R259,IF(LEFT(R259,3)=\"BDI\",HLOOKUP(R259,DADOS!$T$37:$X$38,2,FALSE),0)),15-11*$X$5)","v":0.26390000000000002}]
["S",0,16,5,0,0,13,0,0,"Serviço","16.5.13.","COMP.","028","TOMADA DE PISO COMPLETA (2 MÓDULOS), INCLUINDO CAIXA DE PISO EM ALUMÍNIO P/ DUAS TOMADAS (4X4\"), PLACA EM LATÃO COM 2 TAMPAS UNHA - LIXADA, 2 TOMADAS 2P+T 20A","UN",2,null,"BDI 1",0,0,"SEM VALOR",{"$f":"IF(OR($A260=0,$A260=\"S\",$A260>CFF!$A$9),\"\",MAX(V$12:OFFSET(V260,-1,0))+1)","v":""},"COMP.-028",{"$error":"#REF!"},81.22,{"$f":"ROUND(IF(ISNUMBER(R260),R260,IF(LEFT(R260,3)=\"BDI\",HLOOKUP(R260,DADOS!$T$37:$X$38,2,FALSE),0)),15-11*$X$5)","v":0.26390000000000002}]
["S",0,16,5,0,0,14,0,0,"Serviço","16.5.14.","SINAPI-I","39391","LUMINARIA LED REFLETOR RETANGULAR BIVOLT, LUZ BRANCA, 50 W","UN",3,null,"BDI 1",0,0,"SEM VALOR",{"$f":"IF(OR($A261=0,$A261=\"S\",$A261>CFF!$A$9),\"\",MAX(V$12:OFFSET(V261,-1,0))+1)","v":""},"SINAPI-I-39391",{"$error":"#REF!"},261.55,{"$f":"ROUND(IF(ISNUMBER(R261),R261,IF(LEFT(R261,3)=\"BDI\",HLOOKUP(R261,DADOS!$T$37:$X$38,2,FALSE),0)),15-11*$X$5)","v":0.26390000000000002}]
["S",0,16,5,0,0,15,0,0,"Serviço","16.5.15.","SINAPI","83399","RELE FOTOELETRICO P/ COMANDO DE ILUMINACAO EXTERNA 220V/1000W - FORNECIMENTO E INSTALACAO","UN",2,null,"BDI 1",0,0,"SEM VALOR",{"$f":"IF(OR($A262=0,$A262=\"S\",$A262>CFF!$A$9),\"\",MAX(V$12:OFFSET(V262,-1,0))+1)","v":""},"SINAPI-83399",{"$error":"#REF!"},33.159999999999997,{"$f":"ROUND(IF(ISNUMBER(R262),R262,IF(LEFT(R262,3)=\"BDI\",HLOOKUP(R262,DADOS!$T$37:$X$38,2,FALSE),0)),15-11*$X$5)","v":0.26390000000000002}]
["S",0,16,5,0,0,16,0,0,"Serviço","16.5.16.","SINAPI","97607","LUMINÁRIA ARANDELA TIPO TARTARUGA PARA 1 LÂMPADA LED - FORNECIMENTO E INSTALAÇÃO. AF_11/2017","UN",2,null,"BDI 1",0,0,"SEM VALOR",{"$f":"IF(OR($A263=0,$A263=\"S\",$A263>CFF!$A$9),\"\",MAX(V$12:OFFSET(V263,-1,0))+1)","v":""},"SINAPI-97607",{"$error":"#REF!"},113.31,{"$f":"ROUND(IF(ISNUMBER(R263),R263,IF(LEFT(R263,3)=\"BDI\",HLOOKUP(R263,DADOS!$T$37:$X$38,2,FALSE),0)),15-11*$X$5)","v":0.26390000000000002}]
["S",0,16,5,0,0,17,0,0,"Serviço","16.5.17.","SINAPI","73953/8","LUMINÁRIAS TIPO CALHA, DE SOBREPOR, COM REATORES DE PARTIDA RÁPIDA E LÂMPADAS FLUORESCENTES 2X2X36W, COMPLETAS, FORNECIMENTO E INSTALAÇÃO","UN",2,null,"BDI 1",0,0,"SEM VALOR",{"$f":"IF(OR($A264=0,$A264=\"S\",$A264>CFF!$A$9),\"\",MAX(V$12:OFFSET(V264,-1,0))+1)","v":""},"SINAPI-73953/8",{"$error":"#REF!"},202.4,{"$f":"ROUND(IF(ISNUMBER(R264),R264,IF(LEFT(R264,3)=\"BDI\",HLOOKUP(R264,DADOS!$T$37:$X$38,2,FALSE),0)),15-11*$X$5)","v":0.26390000000000002}]
["S",0,{"$f":"IF($A265=1,OFFSET(C265,-1,0)+1,OFFSET(C265,-1,0))","v":16},{"$f":"IF($A265=1,0,IF($A265=2,OFFSET(D265,-1,0)+1,OFFSET(D265,-1,0)))","v":5},{"$f":"IF(AND($A265<=2,$A265<>0),0,IF($A265=3,OFFSET(E265,-1,0)+1,OFFSET(E265,-1,0)))","v":0},{"$f":"IF(AND($A265<=3,$A265<>0),0,IF($A265=4,OFFSET(F265,-1,0)+1,OFFSET(F265,-1,0)))","v":0},{"$f":"IF(AND($A265<=4,$A265<>0),0,IF($A265=\"S\",OFFSET(G265,-1,0)+1,OFFSET(G265,-1,0)))","v":18},0,0,"Serviço","16.5.18.","COMP.","036","LUMINARIA LED PLAFON QUADRADA DE SOBREPOR BIVOLT, MÍNIMO 20 W, MÍNIMO 2000 LUMENS, BRANCO FRIO, EM ALUMÍNIO, FP>0,95, INCLUSO DRIVER - FORNECIMENTO E INSTALAÇÃO","UN",13,null,"BDI 1",{"$f":"IF($A265=\"S\",IF($Q$10=\"Preço Unitário (R$)\",PO.CustoUnitario,ROUND(PO.CustoUnitario*(1+$Z265),15-13*$X$6)),0)","v":0},{"$f":"IF($A265=\"S\",VTOTAL1,IF($A265=0,0,ROUND(SomaAgrup,15-13*$X$7)))","v":0},{"$f":"IF($J265=\"\",\"\",IF($N265=\"\",\"DESCRIÇÃO\",IF(AND($J265=\"Serviço\",$O265=\"\"),\"UNIDADE\",IF($T265<=0,\"SEM VALOR\",IF(AND($Y265<>\"\",$Q265>$Y265),\"ACIMA REF.\",\"\")))))","v":"SEM VALOR"},{"$f":"IF(OR($A265=0,$A265=\"S\",$A265>CFF!$A$9),\"\",MAX(V$12:OFFSET(V265,-1,0))+1)","v":""},{"$f":"IF(AND($J265=\"Serviço\",$M265<>\"\"),IF($L265=\"\",$M265,CONCATENATE($L265,\"-\",$M265)))","v":"COMP.-036"},{"$f":"IF(AND(Fonte<>\"\",Código<>\"\"),MATCH(Fonte&\" \"&IF(Fonte=\"sinapi\",SUBSTITUTE(SUBSTITUTE(Código,\"/00\",\"/\"),\"/0\",\"/\"),Código),INDIRECT(\"'[Referência \"&_xlnm.Database&\".xls]Banco'!$a:$a\"),0),\"X\")","v":{"$error":"#REF!"}},88.92,{"$f":"ROUND(IF(ISNUMBER(R265),R265,IF(LEFT(R265,3)=\"BDI\",HLOOKUP(R265,DADOS!$T$37:$X$38,2,FALSE),0)),15-11*$X$5)","v":0.26390000000000002}]
["S",0,16,5,0,0,19,0,0,"Serviço","16.5.19.","COMP.","004","LUMINÁRIA TIPO CALHA, DE SOBREPOR, COM 4 LÂMPADAS TUBULARES DE 32 W - FORNECIMENTO E INSTALAÇÃO","UN",12,null,"BDI 1",0,0,"SEM VALOR",{"$f":"IF(OR($A266=0,$A266=\"S\",$A266>CFF!$A$9),\"\",MAX(V$12:OFFSET(V266,-1,0))+1)","v":""},"COMP.-004",{"$error":"#REF!"},195.02,{"$f":"ROUND(IF(ISNUMBER(R266),R266,IF(LEFT(R266,3)=\"BDI\",HLOOKUP(R266,DADOS!$T$37:$X$38,2,FALSE),0)),15-11*$X$5)","v":0.26390000000000002}]
["S",0,16,5,0,0,20,0,0,"Serviço","16.5.20.","SINAPI","91936","CAIXA OCTOGONAL 4\" X 4\", PVC, INSTALADA EM LAJE - FORNECIMENTO E INSTALAÇÃO. AF_12/2015","UN",27,null,"BDI 1",0,0,"SEM VALOR",{"$f":"IF(OR($A267=0,$A267=\"S\",$A267>CFF!$A$9),\"\",MAX(V$12:OFFSET(V267,-1,0))+1)","v":""},"SINAPI-91936",{"$error":"#REF!"},10.89,{"$f":"ROUND(IF(ISNUMBER(R267),R267,IF(LEFT(R267,3)=\"BDI\",HLOOKUP(R267,DADOS!$T$37:$X$38,2,FALSE),0)),15-11*$X$5)","v":0.26390000000000002}]
[1,29,17,0,0,0,0,98,29,"Meta","17.",null,null,"INSTALAÇÕES TELEFÔNICAS, LÓGICA E ALARME","",0,null,"BDI 1",0,0,"SEM VALOR",{"$f":"IF(OR($A268=0,$A268=\"S\",$A268>CFF!$A$9),\"\",MAX(V$12:OFFSET(V268,-1,0))+1)","v":44},false,"X",0,{"$f":"ROUND(IF(ISNUMBER(R268),R268,IF(LEFT(R268,3)=\"BDI\",HLOOKUP(R268,DADOS!$T$37:$X$38,2,FALSE),0)),15-11*$X$5)","v":0.26390000000000002}]
["S",0,17,0,0,0,1,{"$f":"IF(OR($A269=\"S\",$A269=0),0,MATCH(0,OFFSET($B269,1,$A269,ROW($A$366)-ROW($A269)),0))","v":0},{"$f":"IF(OR($A269=\"S\",$A269=0),0,MATCH(OFFSET($B269,0,$A269)+1,OFFSET($B269,1,$A269,ROW($A$366)-ROW($A269)),0))","v":0},"Serviço","17.0.1.","SINAPI","98295","CABO ELETRÔNICO CATEGORIA 5E, INSTALADO EM EDIFICAÇÃO INSTITUCIONAL - FORNECIMENTO E INSTALAÇÃO. AF_03/2018","M",110,null,"BDI 1",0,0,"SEM VALOR",{"$f":"IF(OR($A269=0,$A269=\"S\",$A269>CFF!$A$9),\"\",MAX(V$12:OFFSET(V269,-1,0))+1)","v":""},"SINAPI-98295",{"$error":"#REF!"},1.88,{"$f":"ROUND(IF(ISNUMBER(R269),R269,IF(LEFT(R269,3)=\"BDI\",HLOOKUP(R269,DADOS!$T$37:$X$38,2,FALSE),0)),15-11*$X$5)","v":0.26390000000000002}]
["S",0,17,0,0,0,2,0,0,"Serviço","17.0.2.","SINAPI","98288","CABO TELEFÔNICO CCI-50 2 PARES, SEM BLINDAGEM, INSTALADO EM DISTRIBUIÇÃO DE EDIFICAÇÃO INSTITUCIONAL - FORNECIMENTO E INSTALAÇÃO. AF_03/2018","M",80,null,"BDI 1",0,0,"SEM VALOR",{"$f":"IF(OR($A270=0,$A270=\"S\",$A270>CFF!$A$9),\"\",MAX(V$12:OFFSET(V270,-1,0))+1)","v":""},"SINAPI-98288",{"$error":"#REF!"},1.44,{"$f":"ROUND(IF(ISNUMBER(R270),R270,IF(LEFT(R270,3)=\"BDI\",HLOOKUP(R270,DADOS!$T$37:$X$38,2,FALSE),0)),15-11*$X$5)","v":0.26390000000000002}]
["S",0,17,0,0,0,3,0,0,"Serviço","17.0.3.","COMP.","034","CABO COAXIAL RG6 95% MALHA, INSTALADO EM EDIFICAÇÃO INSTITUCIONAL - FORNECIMENTO E INSTALAÇÃO.","M",37,null,"BDI 1",0,0,"SEM VALOR",{"$f":"IF(OR($A271=0,$A271=\"S\",$A271>CFF!$A$9),\"\",MAX(V$12:OFFSET(V271,-1,0))+1)","v":""},"COMP.-034",{"$error":"#REF!"},5.31,{"$f":"ROUND(IF(ISNUMBER(R271),R271,IF(LEFT(R271,3)=\"BDI\",HLOOKUP(R271,DADOS!$T$37:$X$38,2,FALSE),0)),15-11*$X$5)","v":0.26390000000000002}]
[{"$f":"CHOOSE(1+LOG(1+2*(J272=\"Meta\")+4*(J272=\"Nível 2\")+8*(J272=\"Nível 3\")+16*(J272=\"Nível 4\")+32*(J272=\"Serviço\"),2),0,1,2,3,4,\"S\")","v":"S"},{"$f":"IF(OR(A272=\"S\",A272=0),0,IF(ISERROR(I272),H272,SMALL(H272:I272,1)))","v":0},{"$f":"IF($A272=1,OFFSET(C272,-1,0)+1,OFFSET(C272,-1,0))","v":17},{"$f":"IF($A272=1,0,IF($A272=2,OFFSET(D272,-1,0)+1,OFFSET(D272,-1,0)))","v":0},{"$f":"IF(AND($A272<=2,$A272<>0),0,IF($A272=3,OFFSET(E272,-1,0)+1,OFFSET(E272,-1,0)))","v":0},{"$f":"IF(AND($A272<=3,$A272<>0),0,IF($A272=4,OFFSET(F272,-1,0)+1,OFFSET(F272,-1,0)))","v":0},{"$f":"IF(AND($A272<=4,$A272<>0),0,IF($A272=\"S\",OFFSET(G272,-1,0)+1,OFFSET(G272,-1,0)))","v":4},0,0,"Serviço",{"$f":"IF($A272=0,\"-\",CONCATENATE(C272&\".\",IF(AND($A$5>=2,$A272>=2),D272&\".\",\"\"),IF(AND($A$5>=3,$A272>=3),E272&\".\",\"\"),IF(AND($A$5>=4,$A272>=4),F272&\".\",\"\"),IF($A272=\"S\",G272&\".\",\"\")))","v":"17.0.4."},"COMP.","039","CABO 2 PARES - CCI 4X50 - BRANCO, PARA ALARME - FORNECIMENTO E INSTALAÇÃO","M",130,null,"BDI 1",{"$f":"IF($A272=\"S\",IF($Q$10=\"Preço Unitário (R$)\",PO.CustoUnitario,ROUND(PO.CustoUnitario*(1+$Z272),15-13*$X$6)),0)","v":0},{"$f":"IF($A272=\"S\",VTOTAL1,IF($A272=0,0,ROUND(SomaAgrup,15-13*$X$7)))","v":0},{"$f":"IF($J272=\"\",\"\",IF($N272=\"\",\"DESCRIÇÃO\",IF(AND($J272=\"Serviço\",$O272=\"\"),\"UNIDADE\",IF($T272<=0,\"SEM VALOR\",IF(AND($Y272<>\"\",$Q272>$Y272),\"ACIMA REF.\",\"\")))))","v":"SEM VALOR"},{"$f":"IF(OR($A272=0,$A272=\"S\",$A272>CFF!$A$9),\"\",MAX(V$12:OFFSET(V272,-1,0))+1)","v":""},{"$f":"IF(AND($J272=\"Serviço\",$M272<>\"\"),IF($L272=\"\",$M272,CONCATENATE($L272,\"-\",$M272)))","v":"COMP.-039"},{"$f":"IF(AND(Fonte<>\"\",Código<>\"\"),MATCH(Fonte&\" \"&IF(Fonte=\"sinapi\",SUBSTITUTE(SUBSTITUTE(Código,\"/00\",\"/\"),\"/0\",\"/\"),Código),INDIRECT(\"'[Referência \"&_xlnm.Database&\".xls]Banco'!$a:$a\"),0),\"X\")","v":{"$error":"#REF!"}},2.15,{"$f":"ROUND(IF(ISNUMBER(R272),R272,IF(LEFT(R272,3)=\"BDI\",HLOOKUP(R272,DADOS!$T$37:$X$38,2,FALSE),0)),15-11*$X$5)","v":0.26390000000000002}]
["S",0,17,0,0,0,5,0,0,"Serviço","17.0.5.","SINAPI-I","34602","CABO FLEXIVEL PVC 750 V, 2 CONDUTORES DE 1,5 MM2","M",7.8,null,"BDI 1",0,0,"SEM VALOR",{"$f":"IF(OR($A273=0,$A273=\"S\",$A273>CFF!$A$9),\"\",MAX(V$12:OFFSET(V273,-1,0))+1)","v":""},"SINAPI-I-34602",{"$error":"#REF!"},3.07,{"$f":"ROUND(IF(ISNUMBER(R273),R273,IF(LEFT(R273,3)=\"BDI\",HLOOKUP(R273,DADOS!$T$37:$X$38,2,FALSE),0)),15-11*$X$5)","v":0.26390000000000002}]
["S",0,17,0,0,0,6,0,0,"Serviço","17.0.6.","SINAPI","91844","ELETRODUTO FLEXÍVEL CORRUGADO, PVC, DN 25 MM (3/4\"), PARA CIRCUITOS TERMINAIS, INSTALADO EM LAJE - FORNECIMENTO E INSTALAÇÃO. AF_12/2015","M",78,null,"BDI 1",0,0,"SEM VALOR",{"$f":"IF(OR($A274=0,$A274=\"S\",$A274>CFF!$A$9),\"\",MAX(V$12:OFFSET(V274,-1,0))+1)","v":""},"SINAPI-91844",{"$error":"#REF!"},5.33,{"$f":"ROUND(IF(ISNUMBER(R274),R274,IF(LEFT(R274,3)=\"BDI\",HLOOKUP(R274,DADOS!$T$37:$X$38,2,FALSE),0)),15-11*$X$5)","v":0.26390000000000002}]
["S",0,17,0,0,0,7,0,0,"Serviço","17.0.7.","SINAPI","91842","ELETRODUTO FLEXÍVEL CORRUGADO, PVC, DN 20 MM (1/2\"), PARA CIRCUITOS TERMINAIS, INSTALADO EM LAJE - FORNECIMENTO E INSTALAÇÃO. AF_12/2015","M",49.4,null,"BDI 1",0,0,"SEM VALOR",{"$f":"IF(OR($A275=0,$A275=\"S\",$A275>CFF!$A$9),\"\",MAX(V$12:OFFSET(V275,-1,0))+1)","v":""},"SINAPI-91842",{"$error":"#REF!"},4.5999999999999996,{"$f":"ROUND(IF(ISNUMBER(R275),R275,IF(LEFT(R275,3)=\"BDI\",HLOOKUP(R275,DADOS!$T$37:$X$38,2,FALSE),0)),15-11*$X$5)","v":0.26390000000000002}]
["S",0,17,0,0,0,8,0,0,"Serviço","17.0.8.","COMP.","029","TOMADA DE PISO,  INCLUINDO CAIXA DE PISO EM ALUMÍNIO 4X2\", PLACA EM LATÃO COM TAMPA UNHA - LIXADA, SUPORTES, 1 TOMADA FÊMEA PARA RJ-45 (LÓGICA) E TOMADA FÊMEA PARA RJ-11(TELEFÔNICA)","UN",2,null,"BDI 1",0,0,"SEM VALOR",{"$f":"IF(OR($A276=0,$A276=\"S\",$A276>CFF!$A$9),\"\",MAX(V$12:OFFSET(V276,-1,0))+1)","v":""},"COMP.-029",{"$error":"#REF!"},80.69,{"$f":"ROUND(IF(ISNUMBER(R276),R276,IF(LEFT(R276,3)=\"BDI\",HLOOKUP(R276,DADOS!$T$37:$X$38,2,FALSE),0)),15-11*$X$5)","v":0.26390000000000002}]
["S",0,17,0,0,0,9,0,0,"Serviço","17.0.9.","SINAPI","91941","CAIXA RETANGULAR 4\" X 2\" BAIXA (0,30 M DO PISO), PVC, INSTALADA EM PAREDE - FORNECIMENTO E INSTALAÇÃO. AF_12/2015","UN",6,null,"BDI 1",0,0,"SEM VALOR",{"$f":"IF(OR($A277=0,$A277=\"S\",$A277>CFF!$A$9),\"\",MAX(V$12:OFFSET(V277,-1,0))+1)","v":""},"SINAPI-91941",{"$error":"#REF!"},8.14,{"$f":"ROUND(IF(ISNUMBER(R277),R277,IF(LEFT(R277,3)=\"BDI\",HLOOKUP(R277,DADOS!$T$37:$X$38,2,FALSE),0)),15-11*$X$5)","v":0.26390000000000002}]
["S",0,17,0,0,0,10,0,0,"Serviço","17.0.10.","SINAPI","91940","CAIXA RETANGULAR 4\" X 2\" MÉDIA (1,30 M DO PISO), PVC, INSTALADA EM PAREDE - FORNECIMENTO E INSTALAÇÃO. AF_12/2015","UN",3,null,"BDI 1",0,0,"SEM VALOR",{"$f":"IF(OR($A278=0,$A278=\"S\",$A278>CFF!$A$9),\"\",MAX(V$12:OFFSET(V278,-1,0))+1)","v":""},"SINAPI-91940",{"$error":"#REF!"},12.06,{"$f":"ROUND(IF(ISNUMBER(R278),R278,IF(LEFT(R278,3)=\"BDI\",HLOOKUP(R278,DADOS!$T$37:$X$38,2,FALSE),0)),15-11*$X$5)","v":0.26390000000000002}]
["S",0,17,0,0,0,11,0,0,"Serviço","17.0.11.","SINAPI","91939","CAIXA RETANGULAR 4\" X 2\" ALTA (2,00 M DO PISO), PVC, INSTALADA EM PAREDE - FORNECIMENTO E INSTALAÇÃO. AF_12/2015","UN",22,null,"BDI 1",0,0,"SEM VALOR",{"$f":"IF(OR($A279=0,$A279=\"S\",$A279>CFF!$A$9),\"\",MAX(V$12:OFFSET(V279,-1,0))+1)","v":""},"SINAPI-91939",{"$error":"#REF!"},22.5,{"$f":"ROUND(IF(ISNUMBER(R279),R279,IF(LEFT(R279,3)=\"BDI\",HLOOKUP(R279,DADOS!$T$37:$X$38,2,FALSE),0)),15-11*$X$5)","v":0.26390000000000002}]
["S",0,17,0,0,0,12,0,0,"Serviço","17.0.12.","SINAPI","91944","CAIXA RETANGULAR 4\" X 4\" BAIXA (0,30 M DO PISO), PVC, INSTALADA EM PAREDE - FORNECIMENTO E INSTALAÇÃO. AF_12/2015","UN",1,null,"BDI 1",0,0,"SEM VALOR",{"$f":"IF(OR($A280=0,$A280=\"S\",$A280>CFF!$A$9),\"\",MAX(V$12:OFFSET(V280,-1,0))+1)","v":""},"SINAPI-91944",{"$error":"#REF!"},11.19,{"$f":"ROUND(IF(ISNUMBER(R280),R280,IF(LEFT(R280,3)=\"BDI\",HLOOKUP(R280,DADOS!$T$37:$X$38,2,FALSE),0)),15-11*$X$5)","v":0.26390000000000002}]
["S",0,17,0,0,0,13,0,0,"Serviço","17.0.13.","SINAPI-I","7543","TAMPA CEGA EM PVC PARA CONDULETE 4 X 2\"","UN",3,null,"BDI 1",0,0,"SEM VALOR",{"$f":"IF(OR($A281=0,$A281=\"S\",$A281>CFF!$A$9),\"\",MAX(V$12:OFFSET(V281,-1,0))+1)","v":""},"SINAPI-I-7543",{"$error":"#REF!"},4.7300000000000004,{"$f":"ROUND(IF(ISNUMBER(R281),R281,IF(LEFT(R281,3)=\"BDI\",HLOOKUP(R281,DADOS!$T$37:$X$38,2,FALSE),0)),15-11*$X$5)","v":0.26390000000000002}]
["S",0,17,0,0,0,14,0,0,"Serviço","17.0.14.","COMP.","005","TOMADA BAIXA DE EMBUTIR (3 MÓDULOS: 1 RJ 45, 1 RJ 11, 1 CEGO ), DETALHE 3, INCLUINDO SUPORTE E PLACA - FORNECIMENTO E INSTALAÇÃO.","UN",3,null,"BDI 1",0,0,"SEM VALOR",{"$f":"IF(OR($A282=0,$A282=\"S\",$A282>CFF!$A$9),\"\",MAX(V$12:OFFSET(V282,-1,0))+1)","v":""},"COMP.-005",{"$error":"#REF!"},79.41,{"$f":"ROUND(IF(ISNUMBER(R282),R282,IF(LEFT(R282,3)=\"BDI\",HLOOKUP(R282,DADOS!$T$37:$X$38,2,FALSE),0)),15-11*$X$5)","v":0.26390000000000002}]
["S",0,17,0,0,0,15,0,0,"Serviço","17.0.15.","COMP.","006","TOMADA BAIXA DE EMBUTIR (3 MÓDULOS: 1 RJ 45, 2 CEGOS ), DETALHE 2, INCLUINDO SUPORTE E PLACA - FORNECIMENTO E INSTALAÇÃO.","UN",1,null,"BDI 1",0,0,"SEM VALOR",{"$f":"IF(OR($A283=0,$A283=\"S\",$A283>CFF!$A$9),\"\",MAX(V$12:OFFSET(V283,-1,0))+1)","v":""},"COMP.-006",{"$error":"#REF!"},61.73,{"$f":"ROUND(IF(ISNUMBER(R283),R283,IF(LEFT(R283,3)=\"BDI\",HLOOKUP(R283,DADOS!$T$37:$X$38,2,FALSE),0)),15-11*$X$5)","v":0.26390000000000002}]
["S",0,17,0,0,0,16,0,0,"Serviço","17.0.16.","COMP.","007","TOMADA BAIXA DE EMBUTIR 4\"X4\" (6 MÓDULOS: 2 RJ 45, 2 RJ 11, 2 CEGOS ), DETALHE 5, INCLUINDO SUPORTE E PLACA - FORNECIMENTO E INSTALAÇÃO.","UN",1,null,"BDI 1",0,0,"SEM VALOR",{"$f":"IF(OR($A284=0,$A284=\"S\",$A284>CFF!$A$9),\"\",MAX(V$12:OFFSET(V284,-1,0))+1)","v":""},"COMP.-007",{"$error":"#REF!"},156.6,{"$f":"ROUND(IF(ISNUMBER(R284),R284,IF(LEFT(R284,3)=\"BDI\",HLOOKUP(R284,DADOS!$T$37:$X$38,2,FALSE),0)),15-11*$X$5)","v":0.26390000000000002}]
[{"$f":"CHOOSE(1+LOG(1+2*(J285=\"Meta\")+4*(J285=\"Nível 2\")+8*(J285=\"Nível 3\")+16*(J285=\"Nível 4\")+32*(J285=\"Serviço\"),2),0,1,2,3,4,\"S\")","v":"S"},{"$f":"IF(OR(A285=\"S\",A285=0),0,IF(ISERROR(I285),H285,SMALL(H285:I285,1)))","v":0},17,0,0,0,17,0,0,"Serviço",{"$f":"IF($A285=0,\"-\",CONCATENATE(C285&\".\",IF(AND($A$5>=2,$A285>=2),D285&\".\",\"\"),IF(AND($A$5>=3,$A285>=3),E285&\".\",\"\"),IF(AND($A$5>=4,$A285>=4),F285&\".\",\"\"),IF($A285=\"S\",G285&\".\",\"\")))","v":"17.0.17."},"COMP.","008","TOMADA MÉDIA DE EMBUTIR (3 MÓDULOS: 1 RJ 45, 2 CEGOS ), DETALHE 2, INCLUINDO SUPORTE E PLACA - FORNECIMENTO E INSTALAÇÃO.","UN",1,null,"BDI 1",0,0,"SEM VALOR",{"$f":"IF(OR($A285=0,$A285=\"S\",$A285>CFF!$A$9),\"\",MAX(V$12:OFFSET(V285,-1,0))+1)","v":""},"COMP.-008",{"$error":"#REF!"},70.150000000000006,{"$f":"ROUND(IF(ISNUMBER(R285),R285,IF(LEFT(R285,3)=\"BDI\",HLOOKUP(R285,DADOS!$T$37:$X$38,2,FALSE),0)),15-11*$X$5)","v":0.26390000000000002}]
["S",0,17,0,0,0,18,0,0,"Serviço","17.0.18.","COMP.","009","TOMADA ALTA DE EMBUTIR (3 MÓDULOS: 1 RJ 45, 2 CEGOS ), DETALHE 2, INCLUINDO SUPORTE E PLACA - FORNECIMENTO E INSTALAÇÃO.","UN",1,null,"BDI 1",0,0,"SEM VALOR",{"$f":"IF(OR($A286=0,$A286=\"S\",$A286>CFF!$A$9),\"\",MAX(V$12:OFFSET(V286,-1,0))+1)","v":""},"COMP.-009",{"$error":"#REF!"},96.47,{"$f":"ROUND(IF(ISNUMBER(R286),R286,IF(LEFT(R286,3)=\"BDI\",HLOOKUP(R286,DADOS!$T$37:$X$38,2,FALSE),0)),15-11*$X$5)","v":0.26390000000000002}]
["S",0,17,0,0,0,19,0,0,"Serviço","17.0.19.","COMP.","010","TOMADA ALTA DE EMBUTIR (3 MÓDULOS: 1 RJ 45, 2 COAXIAL), DETALHE 4, INCLUINDO SUPORTE E PLACA - FORNECIMENTO E INSTALAÇÃO.","UN",2,null,"BDI 1",0,0,"SEM VALOR",{"$f":"IF(OR($A287=0,$A287=\"S\",$A287>CFF!$A$9),\"\",MAX(V$12:OFFSET(V287,-1,0))+1)","v":""},"COMP.-010",{"$error":"#REF!"},120.03,{"$f":"ROUND(IF(ISNUMBER(R287),R287,IF(LEFT(R287,3)=\"BDI\",HLOOKUP(R287,DADOS!$T$37:$X$38,2,FALSE),0)),15-11*$X$5)","v":0.26390000000000002}]
["S",0,17,0,0,0,20,0,0,"Serviço","17.0.20.","COMP.","011","SENSOR DE PRESENÇA INFRAVERMELHO, COM FIO, PARA ALARME, FIXAÇÃO EM PAREDE, ABERTURA MÍNIMA 115°, ALCANCE MÍNIMO 12 M, COM FIXAÇÃO - FORNECIMENTO E INSTALAÇÃO.","UN",14,null,"BDI 1",0,0,"SEM VALOR",{"$f":"IF(OR($A288=0,$A288=\"S\",$A288>CFF!$A$9),\"\",MAX(V$12:OFFSET(V288,-1,0))+1)","v":""},"COMP.-011",{"$error":"#REF!"},88.12,{"$f":"ROUND(IF(ISNUMBER(R288),R288,IF(LEFT(R288,3)=\"BDI\",HLOOKUP(R288,DADOS!$T$37:$X$38,2,FALSE),0)),15-11*$X$5)","v":0.26390000000000002}]
["S",0,17,0,0,0,21,0,0,"Serviço","17.0.21.","COMP.","038","KIT CENTRAL DE ALARME MONITORADA COMPLETA (1 CENTRAL DE ALARME,  2 BATERIAS SELADAS 12V/7A, 2 MÓDULOS RECEPTOR TECLADO, 1 INTERFACE ETHERNET, 2 SIRENES PIEZOELÉTRICAS, 1 TECLADO LCD AVULSO, 1 FONTE DE ALIMENTAÇÃO) - FORNECIMENTO E INSTALAÇÃO","UN",1,null,"BDI 1",0,0,"SEM VALOR",{"$f":"IF(OR($A289=0,$A289=\"S\",$A289>CFF!$A$9),\"\",MAX(V$12:OFFSET(V289,-1,0))+1)","v":""},"COMP.-038",{"$error":"#REF!"},1963.14,{"$f":"ROUND(IF(ISNUMBER(R289),R289,IF(LEFT(R289,3)=\"BDI\",HLOOKUP(R289,DADOS!$T$37:$X$38,2,FALSE),0)),15-11*$X$5)","v":0.26390000000000002}]
["S",0,17,0,0,0,22,0,0,"Serviço","17.0.22.","COTAÇÃO","008","ELETROCALHA PERFURADA EM AÇO GALVANIZADO, LARGURA 100MM E ALTURA 50MM, COM TAMPA DE ENCAIXE, INCLUSIVE EMENDA, TERMINAIS E FIXAÇÃO - FORNECIMENTO E INSTALAÇÃO","M",3.5,null,"BDI 1",0,0,"SEM VALOR",{"$f":"IF(OR($A290=0,$A290=\"S\",$A290>CFF!$A$9),\"\",MAX(V$12:OFFSET(V290,-1,0))+1)","v":""},"COTAÇÃO-008",{"$error":"#REF!"},80.599999999999994,{"$f":"ROUND(IF(ISNUMBER(R290),R290,IF(LEFT(R290,3)=\"BDI\",HLOOKUP(R290,DADOS!$T$37:$X$38,2,FALSE),0)),15-11*$X$5)","v":0.26390000000000002}]
["S",0,17,0,0,0,23,0,0,"Serviço","17.0.23.","SINAPI","83370","QUADRO DE DISTRIBUICAO PARA TELEFONE N.3, 40X40X12CM EM CHAPA METALICA, DE EMBUTIR, SEM ACESSORIOS, PADRAO TELEBRAS, FORNECIMENTO E INSTALACAO","UN",1,null,"BDI 1",0,0,"SEM VALOR",{"$f":"IF(OR($A291=0,$A291=\"S\",$A291>CFF!$A$9),\"\",MAX(V$12:OFFSET(V291,-1,0))+1)","v":""},"SINAPI-83370",{"$error":"#REF!"},207.68,{"$f":"ROUND(IF(ISNUMBER(R291),R291,IF(LEFT(R291,3)=\"BDI\",HLOOKUP(R291,DADOS!$T$37:$X$38,2,FALSE),0)),15-11*$X$5)","v":0.26390000000000002}]
["S",0,17,0,0,0,24,0,0,"Serviço","17.0.24.","SINAPI","93008","ELETRODUTO RÍGIDO ROSCÁVEL, PVC, DN 50 MM (1 1/2\") - FORNECIMENTO E INSTALAÇÃO. AF_12/2015","M",20,null,"BDI 1",0,0,"SEM VALOR",{"$f":"IF(OR($A292=0,$A292=\"S\",$A292>CFF!$A$9),\"\",MAX(V$12:OFFSET(V292,-1,0))+1)","v":""},"SINAPI-93008",{"$error":"#REF!"},13.02,{"$f":"ROUND(IF(ISNUMBER(R292),R292,IF(LEFT(R292,3)=\"BDI\",HLOOKUP(R292,DADOS!$T$37:$X$38,2,FALSE),0)),15-11*$X$5)","v":0.26390000000000002}]
["S",0,17,0,0,0,25,0,0,"Serviço","17.0.25.","SINAPI","98400","CABO TELEFÔNICO CTP-APL-50 10 PARES INSTALADO EM ENTRADA DE EDIFICAÇÃO - FORNECIMENTO E INSTALAÇÃO. AF_04/2018","M",20,null,"BDI 1",0,0,"SEM VALOR",{"$f":"IF(OR($A293=0,$A293=\"S\",$A293>CFF!$A$9),\"\",MAX(V$12:OFFSET(V293,-1,0))+1)","v":""},"SINAPI-98400",{"$error":"#REF!"},9.61,{"$f":"ROUND(IF(ISNUMBER(R293),R293,IF(LEFT(R293,3)=\"BDI\",HLOOKUP(R293,DADOS!$T$37:$X$38,2,FALSE),0)),15-11*$X$5)","v":0.26390000000000002}]
["S",0,17,0,0,0,26,0,0,"Serviço","17.0.26.","COMP.","035","RACK DE PAREDE 19\" 8U 570 mm, COM PORTA DE VIDRO E CHAVES, RÉGUA COM 8 TOMADAS 20 A - FORNECIMENTO E INSTALAÇÃO","UN",1,null,"BDI 1",0,0,"SEM VALOR",{"$f":"IF(OR($A294=0,$A294=\"S\",$A294>CFF!$A$9),\"\",MAX(V$12:OFFSET(V294,-1,0))+1)","v":""},"COMP.-035",{"$error":"#REF!"},941.2,{"$f":"ROUND(IF(ISNUMBER(R294),R294,IF(LEFT(R294,3)=\"BDI\",HLOOKUP(R294,DADOS!$T$37:$X$38,2,FALSE),0)),15-11*$X$5)","v":0.26390000000000002}]
["S",0,17,0,0,0,27,0,0,"Serviço","17.0.27.","SINAPI","98301","PATCH PANEL 24 PORTAS, CATEGORIA 5E - FORNECIMENTO E INSTALAÇÃO. AF_03/2018","UN",1,null,"BDI 1",0,0,"SEM VALOR",{"$f":"IF(OR($A295=0,$A295=\"S\",$A295>CFF!$A$9),\"\",MAX(V$12:OFFSET(V295,-1,0))+1)","v":""},"SINAPI-98301",{"$error":"#REF!"},515.14,{"$f":"ROUND(IF(ISNUMBER(R295),R295,IF(LEFT(R295,3)=\"BDI\",HLOOKUP(R295,DADOS!$T$37:$X$38,2,FALSE),0)),15-11*$X$5)","v":0.26390000000000002}]
["S",0,17,0,0,0,28,0,0,"Serviço","17.0.28.","COTAÇÃO","009","ALARME BANHEIRO PNE, EM CONFORMIDADE COM A NBR 9050/2015, COM ACIONADOR TIPO BOTEIRA SOCO E SIRENE AÚDIO VISUAL EM LED, COM PLACA FOTOLUMINESCENTE E BRAILE EM ALUMÍNIO, 220V","UN",2,null,"BDI 1",0,0,"SEM VALOR",{"$f":"IF(OR($A296=0,$A296=\"S\",$A296>CFF!$A$9),\"\",MAX(V$12:OFFSET(V296,-1,0))+1)","v":""},"COTAÇÃO-009",{"$error":"#REF!"},691.53,{"$f":"ROUND(IF(ISNUMBER(R296),R296,IF(LEFT(R296,3)=\"BDI\",HLOOKUP(R296,DADOS!$T$37:$X$38,2,FALSE),0)),15-11*$X$5)","v":0.26390000000000002}]
[1,24,18,0,0,0,0,69,24,"Meta","18.",null,null,"LOUÇAS E METAIS","",0,null,"BDI 1",0,0,"SEM VALOR",{"$f":"IF(OR($A297=0,$A297=\"S\",$A297>CFF!$A$9),\"\",MAX(V$12:OFFSET(V297,-1,0))+1)","v":45},false,"X",0,{"$f":"ROUND(IF(ISNUMBER(R297),R297,IF(LEFT(R297,3)=\"BDI\",HLOOKUP(R297,DADOS!$T$37:$X$38,2,FALSE),0)),15-11*$X$5)","v":0.26390000000000002}]
["S",0,18,0,0,0,1,0,0,"Serviço","18.0.1.","SINAPI","86932","VASO SANITÁRIO SIFONADO COM CAIXA ACOPLADA LOUÇA BRANCA - PADRÃO MÉDIO, INCLUSO ENGATE FLEXÍVEL EM METAL CROMADO, 1/2\u0094 X 40CM - FORNECIMENTO E INSTALAÇÃO. AF_12/2013","UN",4,null,"BDI 1",0,0,"SEM VALOR",{"$f":"IF(OR($A298=0,$A298=\"S\",$A298>CFF!$A$9),\"\",MAX(V$12:OFFSET(V298,-1,0))+1)","v":""},"SINAPI-86932",{"$error":"#REF!"},534.91,{"$f":"ROUND(IF(ISNUMBER(R298),R298,IF(LEFT(R298,3)=\"BDI\",HLOOKUP(R298,DADOS!$T$37:$X$38,2,FALSE),0)),15-11*$X$5)","v":0.26390000000000002}]
["S",0,18,0,0,0,2,0,0,"Serviço","18.0.2.","SINAPI-I","377","ASSENTO SANITARIO DE PLASTICO, TIPO CONVENCIONAL","UN",4,null,"BDI 1",0,0,"SEM VALOR",{"$f":"IF(OR($A299=0,$A299=\"S\",$A299>CFF!$A$9),\"\",MAX(V$12:OFFSET(V299,-1,0))+1)","v":""},"SINAPI-I-377",{"$error":"#REF!"},27.81,{"$f":"ROUND(IF(ISNUMBER(R299),R299,IF(LEFT(R299,3)=\"BDI\",HLOOKUP(R299,DADOS!$T$37:$X$38,2,FALSE),0)),15-11*$X$5)","v":0.26390000000000002}]
["S",0,18,0,0,0,3,0,0,"Serviço","18.0.3.","SINAPI-I","36521","LAVATORIO DE CANTO LOUCA BRANCA SUSPENSO *40 X 30* CM","UN",2,null,"BDI 1",0,0,"SEM VALOR",{"$f":"IF(OR($A300=0,$A300=\"S\",$A300>CFF!$A$9),\"\",MAX(V$12:OFFSET(V300,-1,0))+1)","v":""},"SINAPI-I-36521",{"$error":"#REF!"},157.84,{"$f":"ROUND(IF(ISNUMBER(R300),R300,IF(LEFT(R300,3)=\"BDI\",HLOOKUP(R300,DADOS!$T$37:$X$38,2,FALSE),0)),15-11*$X$5)","v":0.26390000000000002}]
["S",0,18,0,0,0,4,0,0,"Serviço","18.0.4.","SINAPI","86938","CUBA DE EMBUTIR OVAL EM LOUÇA BRANCA, 35 X 50CM OU EQUIVALENTE, INCLUSO VÁLVULA E SIFÃO TIPO GARRAFA EM METAL CROMADO - FORNECIMENTO E INSTALAÇÃO. AF_12/2013","UN",2,null,"BDI 1",0,0,"SEM VALOR",{"$f":"IF(OR($A301=0,$A301=\"S\",$A301>CFF!$A$9),\"\",MAX(V$12:OFFSET(V301,-1,0))+1)","v":""},"SINAPI-86938",{"$error":"#REF!"},407.54,{"$f":"ROUND(IF(ISNUMBER(R301),R301,IF(LEFT(R301,3)=\"BDI\",HLOOKUP(R301,DADOS!$T$37:$X$38,2,FALSE),0)),15-11*$X$5)","v":0.26390000000000002}]
["S",0,18,0,0,0,5,0,0,"Serviço","18.0.5.","SINAPI","86936","CUBA DE EMBUTIR DE AÇO INOXIDÁVEL MÉDIA, INCLUSO VÁLVULA TIPO AMERICANA E SIFÃO TIPO GARRAFA EM METAL CROMADO - FORNECIMENTO E INSTALAÇÃO. AF_12/2013","UN",1,null,"BDI 1",0,0,"SEM VALOR",{"$f":"IF(OR($A302=0,$A302=\"S\",$A302>CFF!$A$9),\"\",MAX(V$12:OFFSET(V302,-1,0))+1)","v":""},"SINAPI-86936",{"$error":"#REF!"},469.16,{"$f":"ROUND(IF(ISNUMBER(R302),R302,IF(LEFT(R302,3)=\"BDI\",HLOOKUP(R302,DADOS!$T$37:$X$38,2,FALSE),0)),15-11*$X$5)","v":0.26390000000000002}]
["S",0,18,0,0,0,6,0,0,"Serviço","18.0.6.","SINAPI","86919","TANQUE DE LOUÇA BRANCA COM COLUNA, 30L OU EQUIVALENTE, INCLUSO SIFÃO FLEXÍVEL EM PVC, VÁLVULA METÁLICA E TORNEIRA DE METAL CROMADO PADRÃO MÉDIO - FORNECIMENTO E INSTALAÇÃO. AF_12/2013","UN",1,null,"BDI 1",0,0,"SEM VALOR",{"$f":"IF(OR($A303=0,$A303=\"S\",$A303>CFF!$A$9),\"\",MAX(V$12:OFFSET(V303,-1,0))+1)","v":""},"SINAPI-86919",{"$error":"#REF!"},913.55,{"$f":"ROUND(IF(ISNUMBER(R303),R303,IF(LEFT(R303,3)=\"BDI\",HLOOKUP(R303,DADOS!$T$37:$X$38,2,FALSE),0)),15-11*$X$5)","v":0.26390000000000002}]
["S",0,18,0,0,0,7,0,0,"Serviço","18.0.7.","SINAPI","95547","SABONETEIRA PLASTICA TIPO DISPENSER PARA SABONETE LIQUIDO COM RESERVATORIO 800 A 1500 ML, INCLUSO FIXAÇÃO. AF_10/2016","UN",4,null,"BDI 1",0,0,"SEM VALOR",{"$f":"IF(OR($A304=0,$A304=\"S\",$A304>CFF!$A$9),\"\",MAX(V$12:OFFSET(V304,-1,0))+1)","v":""},"SINAPI-95547",{"$error":"#REF!"},47.47,{"$f":"ROUND(IF(ISNUMBER(R304),R304,IF(LEFT(R304,3)=\"BDI\",HLOOKUP(R304,DADOS!$T$37:$X$38,2,FALSE),0)),15-11*$X$5)","v":0.26390000000000002}]
["S",0,18,0,0,0,8,0,0,"Serviço","18.0.8.","SINAPI","89987","REGISTRO DE GAVETA BRUTO, LATÃO, ROSCÁVEL, 3/4\", COM ACABAMENTO E CANOPLA CROMADOS. FORNECIDO E INSTALADO EM RAMAL DE ÁGUA. AF_12/2014","UN",4,null,"BDI 1",0,0,"SEM VALOR",{"$f":"IF(OR($A305=0,$A305=\"S\",$A305>CFF!$A$9),\"\",MAX(V$12:OFFSET(V305,-1,0))+1)","v":""},"SINAPI-89987",{"$error":"#REF!"},122.83,{"$f":"ROUND(IF(ISNUMBER(R305),R305,IF(LEFT(R305,3)=\"BDI\",HLOOKUP(R305,DADOS!$T$37:$X$38,2,FALSE),0)),15-11*$X$5)","v":0.26390000000000002}]
["S",0,18,0,0,0,9,0,0,"Serviço","18.0.9.","SINAPI-I","11762","TORNEIRA CROMADA COM BICO PARA JARDIM/TANQUE 1/2 \" OU 3/4 \" (REF 1153)","UN",1,null,"BDI 1",0,0,"SEM VALOR",{"$f":"IF(OR($A306=0,$A306=\"S\",$A306>CFF!$A$9),\"\",MAX(V$12:OFFSET(V306,-1,0))+1)","v":""},"SINAPI-I-11762",{"$error":"#REF!"},93.28,{"$f":"ROUND(IF(ISNUMBER(R306),R306,IF(LEFT(R306,3)=\"BDI\",HLOOKUP(R306,DADOS!$T$37:$X$38,2,FALSE),0)),15-11*$X$5)","v":0.26390000000000002}]
["S",0,18,0,0,0,10,0,0,"Serviço","18.0.10.","SINAPI","86909","TORNEIRA CROMADA TUBO MÓVEL, DE MESA, 1/2\" OU 3/4\", PARA PIA DE COZINHA, PADRÃO ALTO - FORNECIMENTO E INSTALAÇÃO. AF_12/2013","UN",1,null,"BDI 1",0,0,"SEM VALOR",{"$f":"IF(OR($A307=0,$A307=\"S\",$A307>CFF!$A$9),\"\",MAX(V$12:OFFSET(V307,-1,0))+1)","v":""},"SINAPI-86909",{"$error":"#REF!"},162.93,{"$f":"ROUND(IF(ISNUMBER(R307),R307,IF(LEFT(R307,3)=\"BDI\",HLOOKUP(R307,DADOS!$T$37:$X$38,2,FALSE),0)),15-11*$X$5)","v":0.26390000000000002}]
["S",0,18,0,0,0,11,0,0,"Serviço","18.0.11.","SINAPI-I","36796","TORNEIRA CROMADA DE MESA PARA LAVATORIO TEMPORIZADA PRESSAO BICA BAIXA","UN",4,null,"BDI 1",0,0,"SEM VALOR",{"$f":"IF(OR($A308=0,$A308=\"S\",$A308>CFF!$A$9),\"\",MAX(V$12:OFFSET(V308,-1,0))+1)","v":""},"SINAPI-I-36796",{"$error":"#REF!"},262.16000000000003,{"$f":"ROUND(IF(ISNUMBER(R308),R308,IF(LEFT(R308,3)=\"BDI\",HLOOKUP(R308,DADOS!$T$37:$X$38,2,FALSE),0)),15-11*$X$5)","v":0.26390000000000002}]
["S",0,18,0,0,0,12,0,0,"Serviço","18.0.12.","SINAPI","86881","SIFÃO DO TIPO GARRAFA EM METAL CROMADO 1 X 1.1/2\" - FORNECIMENTO E INSTALAÇÃO. AF_12/2013","UN",2,null,"BDI 1",0,0,"SEM VALOR",{"$f":"IF(OR($A309=0,$A309=\"S\",$A309>CFF!$A$9),\"\",MAX(V$12:OFFSET(V309,-1,0))+1)","v":""},"SINAPI-86881",{"$error":"#REF!"},218.57,{"$f":"ROUND(IF(ISNUMBER(R309),R309,IF(LEFT(R309,3)=\"BDI\",HLOOKUP(R309,DADOS!$T$37:$X$38,2,FALSE),0)),15-11*$X$5)","v":0.26390000000000002}]
["S",0,18,0,0,0,13,0,0,"Serviço","18.0.13.","SINAPI","86877","VÁLVULA EM METAL CROMADO 1.1/2\" X 1.1/2\" PARA TANQUE OU LAVATÓRIO, COM OU SEM LADRÃO - FORNECIMENTO E INSTALAÇÃO. AF_12/2013","UN",2,null,"BDI 1",0,0,"SEM VALOR",{"$f":"IF(OR($A310=0,$A310=\"S\",$A310>CFF!$A$9),\"\",MAX(V$12:OFFSET(V310,-1,0))+1)","v":""},"SINAPI-86877",{"$error":"#REF!"},40.14,{"$f":"ROUND(IF(ISNUMBER(R310),R310,IF(LEFT(R310,3)=\"BDI\",HLOOKUP(R310,DADOS!$T$37:$X$38,2,FALSE),0)),15-11*$X$5)","v":0.26390000000000002}]
["S",0,18,0,0,0,14,0,0,"Serviço","18.0.14.","SINAPI","86887","ENGATE FLEXÍVEL EM INOX, 1/2\u0094 X 40CM - FORNECIMENTO E INSTALAÇÃO. AF_12/2013","UN",6,null,"BDI 1",0,0,"SEM VALOR",{"$f":"IF(OR($A311=0,$A311=\"S\",$A311>CFF!$A$9),\"\",MAX(V$12:OFFSET(V311,-1,0))+1)","v":""},"SINAPI-86887",{"$error":"#REF!"},57.12,{"$f":"ROUND(IF(ISNUMBER(R311),R311,IF(LEFT(R311,3)=\"BDI\",HLOOKUP(R311,DADOS!$T$37:$X$38,2,FALSE),0)),15-11*$X$5)","v":0.26390000000000002}]
["S",0,18,0,0,0,15,0,0,"Serviço","18.0.15.","SINAPI-I","37401","TOALHEIRO PLASTICO TIPO DISPENSER PARA PAPEL TOALHA INTERFOLHADO","UN",4,null,"BDI 1",0,0,"SEM VALOR",{"$f":"IF(OR($A312=0,$A312=\"S\",$A312>CFF!$A$9),\"\",MAX(V$12:OFFSET(V312,-1,0))+1)","v":""},"SINAPI-I-37401",{"$error":"#REF!"},41.42,{"$f":"ROUND(IF(ISNUMBER(R312),R312,IF(LEFT(R312,3)=\"BDI\",HLOOKUP(R312,DADOS!$T$37:$X$38,2,FALSE),0)),15-11*$X$5)","v":0.26390000000000002}]
["S",0,18,0,0,0,16,0,0,"Serviço","18.0.16.","SINAPI-I","36212","BARRA DE APOIO LAVATORIO DE CANTO, EM ACO INOX POLIDO, DIAMETRO MINIMO 3 CM.","UN",4,null,"BDI 1",0,0,"SEM VALOR",{"$f":"IF(OR($A313=0,$A313=\"S\",$A313>CFF!$A$9),\"\",MAX(V$12:OFFSET(V313,-1,0))+1)","v":""},"SINAPI-I-36212",{"$error":"#REF!"},601.29,{"$f":"ROUND(IF(ISNUMBER(R313),R313,IF(LEFT(R313,3)=\"BDI\",HLOOKUP(R313,DADOS!$T$37:$X$38,2,FALSE),0)),15-11*$X$5)","v":0.26390000000000002}]
["S",0,18,0,0,0,17,0,0,"Serviço","18.0.17.","SINAPI-I","36206","BARRA DE APOIO RETA, EM ACO INOX POLIDO, COMPRIMENTO 90 CM, DIAMETRO MINIMO 3 CM","UN",4,null,"BDI 1",0,0,"SEM VALOR",{"$f":"IF(OR($A314=0,$A314=\"S\",$A314>CFF!$A$9),\"\",MAX(V$12:OFFSET(V314,-1,0))+1)","v":""},"SINAPI-I-36206",{"$error":"#REF!"},268.29000000000002,{"$f":"ROUND(IF(ISNUMBER(R314),R314,IF(LEFT(R314,3)=\"BDI\",HLOOKUP(R314,DADOS!$T$37:$X$38,2,FALSE),0)),15-11*$X$5)","v":0.26390000000000002}]
["S",0,18,0,0,0,18,0,0,"Serviço","18.0.18.","SINAPI-I","36205","BARRA DE APOIO RETA, EM ACO INOX POLIDO, COMPRIMENTO 70CM, DIAMETRO MINIMO 3 CM","UN",2,null,"BDI 1",0,0,"SEM VALOR",{"$f":"IF(OR($A315=0,$A315=\"S\",$A315>CFF!$A$9),\"\",MAX(V$12:OFFSET(V315,-1,0))+1)","v":""},"SINAPI-I-36205",{"$error":"#REF!"},240.17,{"$f":"ROUND(IF(ISNUMBER(R315),R315,IF(LEFT(R315,3)=\"BDI\",HLOOKUP(R315,DADOS!$T$37:$X$38,2,FALSE),0)),15-11*$X$5)","v":0.26390000000000002}]
["S",0,18,0,0,0,19,0,0,"Serviço","18.0.19.","SINAPI","85005","ESPELHO CRISTAL, ESPESSURA 4MM, COM PARAFUSOS DE FIXACAO, SEM MOLDURA","M2",3.8,null,"BDI 1",0,0,"SEM VALOR",{"$f":"IF(OR($A316=0,$A316=\"S\",$A316>CFF!$A$9),\"\",MAX(V$12:OFFSET(V316,-1,0))+1)","v":""},"SINAPI-85005",{"$error":"#REF!"},351.58,{"$f":"ROUND(IF(ISNUMBER(R316),R316,IF(LEFT(R316,3)=\"BDI\",HLOOKUP(R316,DADOS!$T$37:$X$38,2,FALSE),0)),15-11*$X$5)","v":0.26390000000000002}]
["S",0,18,0,0,0,20,0,0,"Serviço","18.0.20.","SINAPI","74072/2","CORRIMAO EM TUBO ACO GALVANIZADO 2 1/2\" COM BRACADEIRA","M",9.6,null,"BDI 1",0,0,"SEM VALOR",{"$f":"IF(OR($A317=0,$A317=\"S\",$A317>CFF!$A$9),\"\",MAX(V$12:OFFSET(V317,-1,0))+1)","v":""},"SINAPI-74072/2",{"$error":"#REF!"},134.07,{"$f":"ROUND(IF(ISNUMBER(R317),R317,IF(LEFT(R317,3)=\"BDI\",HLOOKUP(R317,DADOS!$T$37:$X$38,2,FALSE),0)),15-11*$X$5)","v":0.26390000000000002}]
["S",0,18,0,0,0,21,0,0,"Serviço","18.0.21.","SINAPI-I","37400","PAPELEIRA PLASTICA TIPO DISPENSER PARA PAPEL HIGIENICO ROLAO","UN",4,null,"BDI 1",0,0,"SEM VALOR",{"$f":"IF(OR($A318=0,$A318=\"S\",$A318>CFF!$A$9),\"\",MAX(V$12:OFFSET(V318,-1,0))+1)","v":""},"SINAPI-I-37400",{"$error":"#REF!"},41.42,{"$f":"ROUND(IF(ISNUMBER(R318),R318,IF(LEFT(R318,3)=\"BDI\",HLOOKUP(R318,DADOS!$T$37:$X$38,2,FALSE),0)),15-11*$X$5)","v":0.26390000000000002}]
[{"$f":"CHOOSE(1+LOG(1+2*(J319=\"Meta\")+4*(J319=\"Nível 2\")+8*(J319=\"Nível 3\")+16*(J319=\"Nível 4\")+32*(J319=\"Serviço\"),2),0,1,2,3,4,\"S\")","v":"S"},{"$f":"IF(OR(A319=\"S\",A319=0),0,IF(ISERROR(I319),H319,SMALL(H319:I319,1)))","v":0},{"$f":"IF($A319=1,OFFSET(C319,-1,0)+1,OFFSET(C319,-1,0))","v":18},{"$f":"IF($A319=1,0,IF($A319=2,OFFSET(D319,-1,0)+1,OFFSET(D319,-1,0)))","v":0},{"$f":"IF(AND($A319<=2,$A319<>0),0,IF($A319=3,OFFSET(E319,-1,0)+1,OFFSET(E319,-1,0)))","v":0},{"$f":"IF(AND($A319<=3,$A319<>0),0,IF($A319=4,OFFSET(F319,-1,0)+1,OFFSET(F319,-1,0)))","v":0},{"$f":"IF(AND($A319<=4,$A319<>0),0,IF($A319=\"S\",OFFSET(G319,-1,0)+1,OFFSET(G319,-1,0)))","v":22},0,0,"Serviço",{"$f":"IF($A319=0,\"-\",CONCATENATE(C319&\".\",IF(AND($A$5>=2,$A319>=2),D319&\".\",\"\"),IF(AND($A$5>=3,$A319>=3),E319&\".\",\"\"),IF(AND($A$5>=4,$A319>=4),F319&\".\",\"\"),IF($A319=\"S\",G319&\".\",\"\")))","v":"18.0.22."},"SINAPI","95541","FIXAÇÃO UTILIZANDO PARAFUSO E BUCHA DE NYLON, SOMENTE MÃO DE OBRA. AF_10/2016","UN",8,null,"BDI 1",{"$f":"IF($A319=\"S\",IF($Q$10=\"Preço Unitário (R$)\",PO.CustoUnitario,ROUND(PO.CustoUnitario*(1+$Z319),15-13*$X$6)),0)","v":0},{"$f":"IF($A319=\"S\",VTOTAL1,IF($A319=0,0,ROUND(SomaAgrup,15-13*$X$7)))","v":0},{"$f":"IF($J319=\"\",\"\",IF($N319=\"\",\"DESCRIÇÃO\",IF(AND($J319=\"Serviço\",$O319=\"\"),\"UNIDADE\",IF($T319<=0,\"SEM VALOR\",IF(AND($Y319<>\"\",$Q319>$Y319),\"ACIMA REF.\",\"\")))))","v":"SEM VALOR"},{"$f":"IF(OR($A319=0,$A319=\"S\",$A319>CFF!$A$9),\"\",MAX(V$12:OFFSET(V319,-1,0))+1)","v":""},{"$f":"IF(AND($J319=\"Serviço\",$M319<>\"\"),IF($L319=\"\",$M319,CONCATENATE($L319,\"-\",$M319)))","v":"SINAPI-95541"},{"$f":"IF(AND(Fonte<>\"\",Código<>\"\"),MATCH(Fonte&\" \"&IF(Fonte=\"sinapi\",SUBSTITUTE(SUBSTITUTE(Código,\"/00\",\"/\"),\"/0\",\"/\"),Código),INDIRECT(\"'[Referência \"&_xlnm.Database&\".xls]Banco'!$a:$a\"),0),\"X\")","v":{"$error":"#REF!"}},3.84,{"$f":"ROUND(IF(ISNUMBER(R319),R319,IF(LEFT(R319,3)=\"BDI\",HLOOKUP(R319,DADOS!$T$37:$X$38,2,FALSE),0)),15-11*$X$5)","v":0.26390000000000002}]
["S",0,18,0,0,0,23,0,0,"Serviço","18.0.23.","SINAPI-I","37399","CABIDE/GANCHO DE BANHEIRO SIMPLES EM METAL CROMADO","UN",2,null,"BDI 1",0,0,"SEM VALOR",{"$f":"IF(OR($A320=0,$A320=\"S\",$A320>CFF!$A$9),\"\",MAX(V$12:OFFSET(V320,-1,0))+1)","v":""},"SINAPI-I-37399",{"$error":"#REF!"},33.57,{"$f":"ROUND(IF(ISNUMBER(R320),R320,IF(LEFT(R320,3)=\"BDI\",HLOOKUP(R320,DADOS!$T$37:$X$38,2,FALSE),0)),15-11*$X$5)","v":0.26390000000000002}]
[1,9,19,0,0,0,0,45,9,"Meta","19.",null,null,"INSTALAÇÕES DE GÁS - GLP","",0,null,"BDI 1",0,0,"SEM VALOR",{"$f":"IF(OR($A321=0,$A321=\"S\",$A321>CFF!$A$9),\"\",MAX(V$12:OFFSET(V321,-1,0))+1)","v":46},false,"X",0,{"$f":"ROUND(IF(ISNUMBER(R321),R321,IF(LEFT(R321,3)=\"BDI\",HLOOKUP(R321,DADOS!$T$37:$X$38,2,FALSE),0)),15-11*$X$5)","v":0.26390000000000002}]
["S",0,19,0,0,0,1,0,0,"Serviço","19.0.1.","SINAPI","92688","TUBO DE AÇO GALVANIZADO COM COSTURA, CLASSE MÉDIA, CONEXÃO ROSQUEADA, DN 20 (3/4\"), INSTALADO EM RAMAIS E SUB-RAMAIS DE GÁS - FORNECIMENTO E INSTALAÇÃO. AF_12/2015","M",15,null,"BDI 1",0,0,"SEM VALOR",{"$f":"IF(OR($A322=0,$A322=\"S\",$A322>CFF!$A$9),\"\",MAX(V$12:OFFSET(V322,-1,0))+1)","v":""},"SINAPI-92688",{"$error":"#REF!"},29.88,{"$f":"ROUND(IF(ISNUMBER(R322),R322,IF(LEFT(R322,3)=\"BDI\",HLOOKUP(R322,DADOS!$T$37:$X$38,2,FALSE),0)),15-11*$X$5)","v":0.26390000000000002}]
["S",0,19,0,0,0,2,0,0,"Serviço","19.0.2.","SINAPI-I","39634","FITA ADESIVA ANTICORROSIVA DE PVC FLEXIVEL, COR PRETA, PARA PROTECAO TUBULACAO, 50 MM X 30 M (L X C), E= *0,25* MM","M",55.4,null,"BDI 1",0,0,"SEM VALOR",{"$f":"IF(OR($A323=0,$A323=\"S\",$A323>CFF!$A$9),\"\",MAX(V$12:OFFSET(V323,-1,0))+1)","v":""},"SINAPI-I-39634",{"$error":"#REF!"},6.4,{"$f":"ROUND(IF(ISNUMBER(R323),R323,IF(LEFT(R323,3)=\"BDI\",HLOOKUP(R323,DADOS!$T$37:$X$38,2,FALSE),0)),15-11*$X$5)","v":0.26390000000000002}]
["S",0,19,0,0,0,3,0,0,"Serviço","19.0.3.","SINAPI","92700","JOELHO 45 GRAUS, EM FERRO GALVANIZADO, CONEXÃO ROSQUEADA, DN 20 (3/4\"), INSTALADO EM RAMAIS E SUB-RAMAIS DE GÁS - FORNECIMENTO E INSTALAÇÃO. AF_12/2015","UN",1,null,"BDI 1",0,0,"SEM VALOR",{"$f":"IF(OR($A324=0,$A324=\"S\",$A324>CFF!$A$9),\"\",MAX(V$12:OFFSET(V324,-1,0))+1)","v":""},"SINAPI-92700",{"$error":"#REF!"},25.72,{"$f":"ROUND(IF(ISNUMBER(R324),R324,IF(LEFT(R324,3)=\"BDI\",HLOOKUP(R324,DADOS!$T$37:$X$38,2,FALSE),0)),15-11*$X$5)","v":0.26390000000000002}]
["S",0,19,0,0,0,4,0,0,"Serviço","19.0.4.","SINAPI","92701","JOELHO 90 GRAUS, EM FERRO GALVANIZADO, CONEXÃO ROSQUEADA, DN 20 (3/4\"), INSTALADO EM RAMAIS E SUB-RAMAIS DE GÁS - FORNECIMENTO E INSTALAÇÃO. AF_12/2015","UN",6,null,"BDI 1",0,0,"SEM VALOR",{"$f":"IF(OR($A325=0,$A325=\"S\",$A325>CFF!$A$9),\"\",MAX(V$12:OFFSET(V325,-1,0))+1)","v":""},"SINAPI-92701",{"$error":"#REF!"},24.34,{"$f":"ROUND(IF(ISNUMBER(R325),R325,IF(LEFT(R325,3)=\"BDI\",HLOOKUP(R325,DADOS!$T$37:$X$38,2,FALSE),0)),15-11*$X$5)","v":0.26390000000000002}]
["S",0,19,0,0,0,5,0,0,"Serviço","19.0.5.","SINAPI-I","20260","MANGUEIRA PARA GAS - GLP, DIAMETRO DE 3/8\", COMPRIMENTO DE 1M","UN",1,null,"BDI 1",0,0,"SEM VALOR",{"$f":"IF(OR($A326=0,$A326=\"S\",$A326>CFF!$A$9),\"\",MAX(V$12:OFFSET(V326,-1,0))+1)","v":""},"SINAPI-I-20260",{"$error":"#REF!"},7.6,{"$f":"ROUND(IF(ISNUMBER(R326),R326,IF(LEFT(R326,3)=\"BDI\",HLOOKUP(R326,DADOS!$T$37:$X$38,2,FALSE),0)),15-11*$X$5)","v":0.26390000000000002}]
["S",0,19,0,0,0,6,0,0,"Serviço","19.0.6.","SINAPI-I","11748","VALVULA DE ESFERA BRUTA EM BRONZE, BITOLA 1/2 \" (REF 1552-B)","UN",1,null,"BDI 1",0,0,"SEM VALOR",{"$f":"IF(OR($A327=0,$A327=\"S\",$A327>CFF!$A$9),\"\",MAX(V$12:OFFSET(V327,-1,0))+1)","v":""},"SINAPI-I-11748",{"$error":"#REF!"},65.48,{"$f":"ROUND(IF(ISNUMBER(R327),R327,IF(LEFT(R327,3)=\"BDI\",HLOOKUP(R327,DADOS!$T$37:$X$38,2,FALSE),0)),15-11*$X$5)","v":0.26390000000000002}]
["S",0,{"$f":"IF($A328=1,OFFSET(C328,-1,0)+1,OFFSET(C328,-1,0))","v":19},{"$f":"IF($A328=1,0,IF($A328=2,OFFSET(D328,-1,0)+1,OFFSET(D328,-1,0)))","v":0},{"$f":"IF(AND($A328<=2,$A328<>0),0,IF($A328=3,OFFSET(E328,-1,0)+1,OFFSET(E328,-1,0)))","v":0},{"$f":"IF(AND($A328<=3,$A328<>0),0,IF($A328=4,OFFSET(F328,-1,0)+1,OFFSET(F328,-1,0)))","v":0},{"$f":"IF(AND($A328<=4,$A328<>0),0,IF($A328=\"S\",OFFSET(G328,-1,0)+1,OFFSET(G328,-1,0)))","v":7},0,0,"Serviço","19.0.7.","COMP.","030","KIT CENTRAL DE GÁS GLP PARA 2 BOTIJÕES P13 (COMPLETO), INCLUSO MANGOTES COM REGISTRO E BORBOLETA, REGULADOR, VÁLVULAS DE ESFERA E CONEXÕES","UN",1,null,"BDI 1",{"$f":"IF($A328=\"S\",IF($Q$10=\"Preço Unitário (R$)\",PO.CustoUnitario,ROUND(PO.CustoUnitario*(1+$Z328),15-13*$X$6)),0)","v":0},{"$f":"IF($A328=\"S\",VTOTAL1,IF($A328=0,0,ROUND(SomaAgrup,15-13*$X$7)))","v":0},{"$f":"IF($J328=\"\",\"\",IF($N328=\"\",\"DESCRIÇÃO\",IF(AND($J328=\"Serviço\",$O328=\"\"),\"UNIDADE\",IF($T328<=0,\"SEM VALOR\",IF(AND($Y328<>\"\",$Q328>$Y328),\"ACIMA REF.\",\"\")))))","v":"SEM VALOR"},{"$f":"IF(OR($A328=0,$A328=\"S\",$A328>CFF!$A$9),\"\",MAX(V$12:OFFSET(V328,-1,0))+1)","v":""},{"$f":"IF(AND($J328=\"Serviço\",$M328<>\"\"),IF($L328=\"\",$M328,CONCATENATE($L328,\"-\",$M328)))","v":"COMP.-030"},{"$f":"IF(AND(Fonte<>\"\",Código<>\"\"),MATCH(Fonte&\" \"&IF(Fonte=\"sinapi\",SUBSTITUTE(SUBSTITUTE(Código,\"/00\",\"/\"),\"/0\",\"/\"),Código),INDIRECT(\"'[Referência \"&_xlnm.Database&\".xls]Banco'!$a:$a\"),0),\"X\")","v":{"$error":"#REF!"}},422.95,{"$f":"ROUND(IF(ISNUMBER(R328),R328,IF(LEFT(R328,3)=\"BDI\",HLOOKUP(R328,DADOS!$T$37:$X$38,2,FALSE),0)),15-11*$X$5)","v":0.26390000000000002}]
["S",0,19,0,0,0,8,{"$f":"IF(OR($A329=\"S\",$A329=0),0,MATCH(0,OFFSET($B329,1,$A329,ROW($A$366)-ROW($A329)),0))","v":0},{"$f":"IF(OR($A329=\"S\",$A329=0),0,MATCH(OFFSET($B329,0,$A329)+1,OFFSET($B329,1,$A329,ROW($A$366)-ROW($A329)),0))","v":0},"Serviço","19.0.8.","SINAPI-I","37558","PLACA DE SINALIZACAO DE SEGURANCA CONTRA INCENDIO, FOTOLUMINESCENTE, RETANGULAR, *20 X 40* CM, EM PVC *2* MM ANTI-CHAMAS (SIMBOLOS, CORES E PICTOGRAMAS CONFORME NBR 13434)","UN",2,null,"BDI 1",0,0,"SEM VALOR",{"$f":"IF(OR($A329=0,$A329=\"S\",$A329>CFF!$A$9),\"\",MAX(V$12:OFFSET(V329,-1,0))+1)","v":""},"SINAPI-I-37558",{"$error":"#REF!"},41.11,{"$f":"ROUND(IF(ISNUMBER(R329),R329,IF(LEFT(R329,3)=\"BDI\",HLOOKUP(R329,DADOS!$T$37:$X$38,2,FALSE),0)),15-11*$X$5)","v":0.26390000000000002}]
[1,6,20,0,0,0,0,36,6,"Meta","20.",null,null,"INSTALAÇÃO DE CLIMATIZAÇÃO","",0,null,"BDI 1",0,0,"SEM VALOR",{"$f":"IF(OR($A330=0,$A330=\"S\",$A330>CFF!$A$9),\"\",MAX(V$12:OFFSET(V330,-1,0))+1)","v":47},false,"X",0,{"$f":"ROUND(IF(ISNUMBER(R330),R330,IF(LEFT(R330,3)=\"BDI\",HLOOKUP(R330,DADOS!$T$37:$X$38,2,FALSE),0)),15-11*$X$5)","v":0.26390000000000002}]
["S",0,20,0,0,0,1,0,0,"Serviço","20.0.1.","SINAPI","89865","TUBO, PVC, SOLDÁVEL, DN 25MM, INSTALADO EM DRENO DE AR-CONDICIONADO - FORNECIMENTO E INSTALAÇÃO. AF_12/2014","M",40.200000000000003,null,"BDI 1",0,0,"SEM VALOR",{"$f":"IF(OR($A331=0,$A331=\"S\",$A331>CFF!$A$9),\"\",MAX(V$12:OFFSET(V331,-1,0))+1)","v":""},"SINAPI-89865",{"$error":"#REF!"},11,{"$f":"ROUND(IF(ISNUMBER(R331),R331,IF(LEFT(R331,3)=\"BDI\",HLOOKUP(R331,DADOS!$T$37:$X$38,2,FALSE),0)),15-11*$X$5)","v":0.26390000000000002}]
["S",0,20,0,0,0,2,0,0,"Serviço","20.0.2.","SINAPI","89866","JOELHO 90 GRAUS, PVC, SOLDÁVEL, DN 25MM, INSTALADO EM DRENO DE AR-CONDICIONADO - FORNECIMENTO E INSTALAÇÃO. AF_12/2014","UN",15,null,"BDI 1",0,0,"SEM VALOR",{"$f":"IF(OR($A332=0,$A332=\"S\",$A332>CFF!$A$9),\"\",MAX(V$12:OFFSET(V332,-1,0))+1)","v":""},"SINAPI-89866",{"$error":"#REF!"},4.1100000000000003,{"$f":"ROUND(IF(ISNUMBER(R332),R332,IF(LEFT(R332,3)=\"BDI\",HLOOKUP(R332,DADOS!$T$37:$X$38,2,FALSE),0)),15-11*$X$5)","v":0.26390000000000002}]
["S",0,20,0,0,0,3,0,0,"Serviço","20.0.3.","COTAÇÃO","010","CAIXA DE PASSAGEM PRÉ - INSTALAÇÃO PARA AR-CONDICIONADO ATÉ 30.000 BTU'S, EM POLIETILENO, INCLUSO TAMPA DE ACABAMENTO E CONEXÕES - FORNECIMENTO E INSTALAÇÃO","UN",7,null,"BDI 1",0,0,"SEM VALOR",{"$f":"IF(OR($A333=0,$A333=\"S\",$A333>CFF!$A$9),\"\",MAX(V$12:OFFSET(V333,-1,0))+1)","v":""},"COTAÇÃO-010",{"$error":"#REF!"},50.56,{"$f":"ROUND(IF(ISNUMBER(R333),R333,IF(LEFT(R333,3)=\"BDI\",HLOOKUP(R333,DADOS!$T$37:$X$38,2,FALSE),0)),15-11*$X$5)","v":0.26390000000000002}]
["S",0,20,0,0,0,4,0,0,"Serviço","20.0.4.","COMP.","022","TUBULAÇÃO EM COBRE FLEXÍVEL (3/8\" E 5/8\" PARA 24.000 BTUS) PARA INTERLIGAÇÃO DE CONDESADOR AO EVAPORADOR, INCLUSIVE ISOLAMENTO TÉRMICO, FITA DE PVC, INTERLIGAÇÃO ELÉTRICA (CABO PP 4 X 1,5MM²), FIXAÇÕES E CONEXÕES - FORNECIMENTO E INSTALAÇÃO","M",7,null,"BDI 1",0,0,"SEM VALOR",{"$f":"IF(OR($A334=0,$A334=\"S\",$A334>CFF!$A$9),\"\",MAX(V$12:OFFSET(V334,-1,0))+1)","v":""},"COMP.-022",{"$error":"#REF!"},110.14,{"$f":"ROUND(IF(ISNUMBER(R334),R334,IF(LEFT(R334,3)=\"BDI\",HLOOKUP(R334,DADOS!$T$37:$X$38,2,FALSE),0)),15-11*$X$5)","v":0.26390000000000002}]
[{"$f":"CHOOSE(1+LOG(1+2*(J335=\"Meta\")+4*(J335=\"Nível 2\")+8*(J335=\"Nível 3\")+16*(J335=\"Nível 4\")+32*(J335=\"Serviço\"),2),0,1,2,3,4,\"S\")","v":"S"},{"$f":"IF(OR(A335=\"S\",A335=0),0,IF(ISERROR(I335),H335,SMALL(H335:I335,1)))","v":0},{"$f":"IF($A335=1,OFFSET(C335,-1,0)+1,OFFSET(C335,-1,0))","v":20},{"$f":"IF($A335=1,0,IF($A335=2,OFFSET(D335,-1,0)+1,OFFSET(D335,-1,0)))","v":0},{"$f":"IF(AND($A335<=2,$A335<>0),0,IF($A335=3,OFFSET(E335,-1,0)+1,OFFSET(E335,-1,0)))","v":0},{"$f":"IF(AND($A335<=3,$A335<>0),0,IF($A335=4,OFFSET(F335,-1,0)+1,OFFSET(F335,-1,0)))","v":0},{"$f":"IF(AND($A335<=4,$A335<>0),0,IF($A335=\"S\",OFFSET(G335,-1,0)+1,OFFSET(G335,-1,0)))","v":5},{"$f":"IF(OR($A335=\"S\",$A335=0),0,MATCH(0,OFFSET($B335,1,$A335,ROW($A$366)-ROW($A335)),0))","v":0},{"$f":"IF(OR($A335=\"S\",$A335=0),0,MATCH(OFFSET($B335,0,$A335)+1,OFFSET($B335,1,$A335,ROW($A$366)-ROW($A335)),0))","v":0},"Serviço",{"$f":"IF($A335=0,\"-\",CONCATENATE(C335&\".\",IF(AND($A$5>=2,$A335>=2),D335&\".\",\"\"),IF(AND($A$5>=3,$A335>=3),E335&\".\",\"\"),IF(AND($A$5>=4,$A335>=4),F335&\".\",\"\"),IF($A335=\"S\",G335&\".\",\"\")))","v":"20.0.5."},"COMP.","023","TUBULAÇÃO EM COBRE FLEXÍVEL (1/4\" E 1/2\" ATÉ 18.000 BTUS) PARA INTERLIGAÇÃO DE CONDESADOR AO EVAPORADOR, INCLUSIVE ISOLAMENTO TÉRMICO, FITA DE PVC, INTERLIGAÇÃO ELÉTRICA (CABO PP 4 X 1,5MM²), FIXAÇÕES E CONEXÕES - FORNECIMENTO E INSTALAÇÃO","M",4,null,"BDI 1",{"$f":"IF($A335=\"S\",IF($Q$10=\"Preço Unitário (R$)\",PO.CustoUnitario,ROUND(PO.CustoUnitario*(1+$Z335),15-13*$X$6)),0)","v":0},{"$f":"IF($A335=\"S\",VTOTAL1,IF($A335=0,0,ROUND(SomaAgrup,15-13*$X$7)))","v":0},{"$f":"IF($J335=\"\",\"\",IF($N335=\"\",\"DESCRIÇÃO\",IF(AND($J335=\"Serviço\",$O335=\"\"),\"UNIDADE\",IF($T335<=0,\"SEM VALOR\",IF(AND($Y335<>\"\",$Q335>$Y335),\"ACIMA REF.\",\"\")))))","v":"SEM VALOR"},{"$f":"IF(OR($A335=0,$A335=\"S\",$A335>CFF!$A$9),\"\",MAX(V$12:OFFSET(V335,-1,0))+1)","v":""},{"$f":"IF(AND($J335=\"Serviço\",$M335<>\"\"),IF($L335=\"\",$M335,CONCATENATE($L335,\"-\",$M335)))","v":"COMP.-023"},{"$f":"IF(AND(Fonte<>\"\",Código<>\"\"),MATCH(Fonte&\" \"&IF(Fonte=\"sinapi\",SUBSTITUTE(SUBSTITUTE(Código,\"/00\",\"/\"),\"/0\",\"/\"),Código),INDIRECT(\"'[Referência \"&_xlnm.Database&\".xls]Banco'!$a:$a\"),0),\"X\")","v":{"$error":"#REF!"}},89.26,{"$f":"ROUND(IF(ISNUMBER(R335),R335,IF(LEFT(R335,3)=\"BDI\",HLOOKUP(R335,DADOS!$T$37:$X$38,2,FALSE),0)),15-11*$X$5)","v":0.26390000000000002}]
[1,8,21,0,0,0,0,30,8,"Meta","21.",null,null,"SISTEMA DE PROTEÇÃO CONTRA INCÊNDIO","",0,null,"BDI 1",0,0,"SEM VALOR",{"$f":"IF(OR($A336=0,$A336=\"S\",$A336>CFF!$A$9),\"\",MAX(V$12:OFFSET(V336,-1,0))+1)","v":48},false,"X",0,{"$f":"ROUND(IF(ISNUMBER(R336),R336,IF(LEFT(R336,3)=\"BDI\",HLOOKUP(R336,DADOS!$T$37:$X$38,2,FALSE),0)),15-11*$X$5)","v":0.26390000000000002}]
["S",0,21,0,0,0,1,0,0,"Serviço","21.0.1.","SINAPI","83635","EXTINTOR INCENDIO TP PO QUIMICO 6KG - FORNECIMENTO E INSTALACAO","UN",2,null,"BDI 1",0,0,"SEM VALOR",{"$f":"IF(OR($A337=0,$A337=\"S\",$A337>CFF!$A$9),\"\",MAX(V$12:OFFSET(V337,-1,0))+1)","v":""},"SINAPI-83635",{"$error":"#REF!"},259.82,{"$f":"ROUND(IF(ISNUMBER(R337),R337,IF(LEFT(R337,3)=\"BDI\",HLOOKUP(R337,DADOS!$T$37:$X$38,2,FALSE),0)),15-11*$X$5)","v":0.26390000000000002}]
["S",0,21,0,0,0,2,0,0,"Serviço","21.0.2.","SINAPI","97599","LUMINÁRIA DE EMERGÊNCIA - FORNECIMENTO E INSTALAÇÃO. AF_11/2017","UN",6,null,"BDI 1",0,0,"SEM VALOR",{"$f":"IF(OR($A338=0,$A338=\"S\",$A338>CFF!$A$9),\"\",MAX(V$12:OFFSET(V338,-1,0))+1)","v":""},"SINAPI-97599",{"$error":"#REF!"},41.18,{"$f":"ROUND(IF(ISNUMBER(R338),R338,IF(LEFT(R338,3)=\"BDI\",HLOOKUP(R338,DADOS!$T$37:$X$38,2,FALSE),0)),15-11*$X$5)","v":0.26390000000000002}]
[{"$f":"CHOOSE(1+LOG(1+2*(J339=\"Meta\")+4*(J339=\"Nível 2\")+8*(J339=\"Nível 3\")+16*(J339=\"Nível 4\")+32*(J339=\"Serviço\"),2),0,1,2,3,4,\"S\")","v":"S"},{"$f":"IF(OR(A339=\"S\",A339=0),0,IF(ISERROR(I339),H339,SMALL(H339:I339,1)))","v":0},{"$f":"IF($A339=1,OFFSET(C339,-1,0)+1,OFFSET(C339,-1,0))","v":21},{"$f":"IF($A339=1,0,IF($A339=2,OFFSET(D339,-1,0)+1,OFFSET(D339,-1,0)))","v":0},{"$f":"IF(AND($A339<=2,$A339<>0),0,IF($A339=3,OFFSET(E339,-1,0)+1,OFFSET(E339,-1,0)))","v":0},{"$f":"IF(AND($A339<=3,$A339<>0),0,IF($A339=4,OFFSET(F339,-1,0)+1,OFFSET(F339,-1,0)))","v":0},{"$f":"IF(AND($A339<=4,$A339<>0),0,IF($A339=\"S\",OFFSET(G339,-1,0)+1,OFFSET(G339,-1,0)))","v":3},{"$f":"IF(OR($A339=\"S\",$A339=0),0,MATCH(0,OFFSET($B339,1,$A339,ROW($A$366)-ROW($A339)),0))","v":0},{"$f":"IF(OR($A339=\"S\",$A339=0),0,MATCH(OFFSET($B339,0,$A339)+1,OFFSET($B339,1,$A339,ROW($A$366)-ROW($A339)),0))","v":0},"Serviço",{"$f":"IF($A339=0,\"-\",CONCATENATE(C339&\".\",IF(AND($A$5>=2,$A339>=2),D339&\".\",\"\"),IF(AND($A$5>=3,$A339>=3),E339&\".\",\"\"),IF(AND($A$5>=4,$A339>=4),F339&\".\",\"\"),IF($A339=\"S\",G339&\".\",\"\")))","v":"21.0.3."},"COMP.","021","ABRIGO DE SOBREPOR PARA EXTINTOR 6KG, COM PINGADEIRA, 75 X 30 X 25 CM, CAIXA E PORTA FABRICADAS EM CHAPA DE AÇO COM TRATAMENTO ANTI-CORROSIVO E PINTURA ELETROSTÁTICA A PÓ NA COR VERMELHA, COM VENTILAÇÃO FRONTAL, DOBRADIÇAS, FECHO TIPO ENGATE RÁPIDO E VISOR EM ACRÍLICO - FORNECIMENTO E INSTALAÇÃO","UN.",1,null,"BDI 1",{"$f":"IF($A339=\"S\",IF($Q$10=\"Preço Unitário (R$)\",PO.CustoUnitario,ROUND(PO.CustoUnitario*(1+$Z339),15-13*$X$6)),0)","v":0},{"$f":"IF($A339=\"S\",VTOTAL1,IF($A339=0,0,ROUND(SomaAgrup,15-13*$X$7)))","v":0},{"$f":"IF($J339=\"\",\"\",IF($N339=\"\",\"DESCRIÇÃO\",IF(AND($J339=\"Serviço\",$O339=\"\"),\"UNIDADE\",IF($T339<=0,\"SEM VALOR\",IF(AND($Y339<>\"\",$Q339>$Y339),\"ACIMA REF.\",\"\")))))","v":"SEM VALOR"},{"$f":"IF(OR($A339=0,$A339=\"S\",$A339>CFF!$A$9),\"\",MAX(V$12:OFFSET(V339,-1,0))+1)","v":""},{"$f":"IF(AND($J339=\"Serviço\",$M339<>\"\"),IF($L339=\"\",$M339,CONCATENATE($L339,\"-\",$M339)))","v":"COMP.-021"},{"$f":"IF(AND(Fonte<>\"\",Código<>\"\"),MATCH(Fonte&\" \"&IF(Fonte=\"sinapi\",SUBSTITUTE(SUBSTITUTE(Código,\"/00\",\"/\"),\"/0\",\"/\"),Código),INDIRECT(\"'[Referência \"&_xlnm.Database&\".xls]Banco'!$a:$a\"),0),\"X\")","v":{"$error":"#REF!"}},282.51,{"$f":"ROUND(IF(ISNUMBER(R339),R339,IF(LEFT(R339,3)=\"BDI\",HLOOKUP(R339,DADOS!$T$37:$X$38,2,FALSE),0)),15-11*$X$5)","v":0.26390000000000002}]
["S",0,21,0,0,0,4,0,0,"Serviço","21.0.4.","COMP.","047","PLACA DE SINALIZACAO DE SEGURANCA CONTRA INCENDIO, FOTOLUMINESCENTE, RETANGULAR, 15 X 30 CM, EM PVC 2 MM ANTI-CHAMAS (SIMBOLOS, CORES E PICTOGRAMAS CONFORME NBR 13434), FORNECIMENTO E INSTALAÇÃO","UN",4,null,"BDI 1",0,0,"SEM VALOR",{"$f":"IF(OR($A340=0,$A340=\"S\",$A340>CFF!$A$9),\"\",MAX(V$12:OFFSET(V340,-1,0))+1)","v":""},"COMP.-047",{"$error":"#REF!"},34.71,{"$f":"ROUND(IF(ISNUMBER(R340),R340,IF(LEFT(R340,3)=\"BDI\",HLOOKUP(R340,DADOS!$T$37:$X$38,2,FALSE),0)),15-11*$X$5)","v":0.26390000000000002}]
["S",0,21,0,0,0,5,0,0,"Serviço","21.0.5.","COMP.","048","PLACA DE SINALIZACAO DE SEGURANCA CONTRA INCENDIO, FOTOLUMINESCENTE, QUADRADA, 30 X 30 CM, EM PVC 2 MM ANTI-CHAMAS (SIMBOLOS, CORES E PICTOGRAMAS CONFORME NBR 13434), FORNECIMENTO E INSTALAÇÃO","UN",3,null,"BDI 1",0,0,"SEM VALOR",{"$f":"IF(OR($A341=0,$A341=\"S\",$A341>CFF!$A$9),\"\",MAX(V$12:OFFSET(V341,-1,0))+1)","v":""},"COMP.-048",{"$error":"#REF!"},64.510000000000005,{"$f":"ROUND(IF(ISNUMBER(R341),R341,IF(LEFT(R341,3)=\"BDI\",HLOOKUP(R341,DADOS!$T$37:$X$38,2,FALSE),0)),15-11*$X$5)","v":0.26390000000000002}]
["S",0,21,0,0,0,6,0,0,"Serviço","21.0.6.","COMP.","049","PLACA DE SINALIZACAO DE SEGURANCA CONTRA INCENDIO, FOTOLUMINESCENTE, QUADRADA, 15 X 15 CM, EM PVC 2 MM ANTI-CHAMAS (SIMBOLOS, CORES E PICTOGRAMAS CONFORME NBR 13434), FORNECIMENTO E INSTALAÇÃO","UN",3,null,"BDI 1",0,0,"SEM VALOR",{"$f":"IF(OR($A342=0,$A342=\"S\",$A342>CFF!$A$9),\"\",MAX(V$12:OFFSET(V342,-1,0))+1)","v":""},"COMP.-049",{"$error":"#REF!"},18.690000000000001,{"$f":"ROUND(IF(ISNUMBER(R342),R342,IF(LEFT(R342,3)=\"BDI\",HLOOKUP(R342,DADOS!$T$37:$X$38,2,FALSE),0)),15-11*$X$5)","v":0.26390000000000002}]
["S",0,21,0,0,0,7,0,0,"Serviço","21.0.7.","SINAPI-I","10892","EXTINTOR DE INCENDIO PORTATIL COM CARGA DE PO QUIMICO SECO (PQS) DE 6 KG, CLASSE BC","UN",1,null,"BDI 1",0,0,"SEM VALOR",{"$f":"IF(OR($A343=0,$A343=\"S\",$A343>CFF!$A$9),\"\",MAX(V$12:OFFSET(V343,-1,0))+1)","v":""},"SINAPI-I-10892",{"$error":"#REF!"},240.14,{"$f":"ROUND(IF(ISNUMBER(R343),R343,IF(LEFT(R343,3)=\"BDI\",HLOOKUP(R343,DADOS!$T$37:$X$38,2,FALSE),0)),15-11*$X$5)","v":0.26390000000000002}]
[1,11,22,0,0,0,0,22,11,"Meta","22.",null,null,"MURO","",0,null,"BDI 1",0,0,"SEM VALOR",{"$f":"IF(OR($A344=0,$A344=\"S\",$A344>CFF!$A$9),\"\",MAX(V$12:OFFSET(V344,-1,0))+1)","v":49},false,"X",0,{"$f":"ROUND(IF(ISNUMBER(R344),R344,IF(LEFT(R344,3)=\"BDI\",HLOOKUP(R344,DADOS!$T$37:$X$38,2,FALSE),0)),15-11*$X$5)","v":0.26390000000000002}]
["S",0,22,0,0,0,1,0,0,"Serviço","22.0.1.","SINAPI","73361","CONCRETO CICLOPICO FCK=10MPA 30% PEDRA DE MAO INCLUSIVE LANCAMENTO","M3",3.37,null,"BDI 1",0,0,"SEM VALOR",{"$f":"IF(OR($A345=0,$A345=\"S\",$A345>CFF!$A$9),\"\",MAX(V$12:OFFSET(V345,-1,0))+1)","v":""},"SINAPI-73361",{"$error":"#REF!"},435.88,{"$f":"ROUND(IF(ISNUMBER(R345),R345,IF(LEFT(R345,3)=\"BDI\",HLOOKUP(R345,DADOS!$T$37:$X$38,2,FALSE),0)),15-11*$X$5)","v":0.26390000000000002}]
["S",0,22,0,0,0,2,0,0,"Serviço","22.0.2.","SINAPI","72131","ALVENARIA EM TIJOLO CERAMICO MACICO 5X10X20CM 1 VEZ (ESPESSURA 20CM), ASSENTADO COM ARGAMASSA TRACO 1:2:8 (CIMENTO, CAL E AREIA)","M2",40.6,null,"BDI 1",0,0,"SEM VALOR",{"$f":"IF(OR($A346=0,$A346=\"S\",$A346>CFF!$A$9),\"\",MAX(V$12:OFFSET(V346,-1,0))+1)","v":""},"SINAPI-72131",{"$error":"#REF!"},138.11000000000001,{"$f":"ROUND(IF(ISNUMBER(R346),R346,IF(LEFT(R346,3)=\"BDI\",HLOOKUP(R346,DADOS!$T$37:$X$38,2,FALSE),0)),15-11*$X$5)","v":0.26390000000000002}]
["S",0,22,0,0,0,3,0,0,"Serviço","22.0.3.","SINAPI","87894","CHAPISCO APLICADO EM ALVENARIA (SEM PRESENÇA DE VÃOS) E ESTRUTURAS DE CONCRETO DE FACHADA, COM COLHER DE PEDREIRO.  ARGAMASSA TRAÇO 1:3 COM PREPARO EM BETONEIRA 400L. AF_06/2014","M2",92.44,null,"BDI 1",0,0,"SEM VALOR",{"$f":"IF(OR($A347=0,$A347=\"S\",$A347>CFF!$A$9),\"\",MAX(V$12:OFFSET(V347,-1,0))+1)","v":""},"SINAPI-87894",{"$error":"#REF!"},5.71,{"$f":"ROUND(IF(ISNUMBER(R347),R347,IF(LEFT(R347,3)=\"BDI\",HLOOKUP(R347,DADOS!$T$37:$X$38,2,FALSE),0)),15-11*$X$5)","v":0.26390000000000002}]
["S",0,22,0,0,0,4,0,0,"Serviço","22.0.4.","SINAPI","87547","MASSA ÚNICA, PARA RECEBIMENTO DE PINTURA, EM ARGAMASSA TRAÇO 1:2:8, PREPARO MECÂNICO COM BETONEIRA 400L, APLICADA MANUALMENTE EM FACES INTERNAS DE PAREDES, ESPESSURA DE 10MM, COM EXECUÇÃO DE TALISCAS. AF_06/2014","M2",92.44,null,"BDI 1",0,0,"SEM VALOR",{"$f":"IF(OR($A348=0,$A348=\"S\",$A348>CFF!$A$9),\"\",MAX(V$12:OFFSET(V348,-1,0))+1)","v":""},"SINAPI-87547",{"$error":"#REF!"},20.21,{"$f":"ROUND(IF(ISNUMBER(R348),R348,IF(LEFT(R348,3)=\"BDI\",HLOOKUP(R348,DADOS!$T$37:$X$38,2,FALSE),0)),15-11*$X$5)","v":0.26390000000000002}]
[{"$f":"CHOOSE(1+LOG(1+2*(J349=\"Meta\")+4*(J349=\"Nível 2\")+8*(J349=\"Nível 3\")+16*(J349=\"Nível 4\")+32*(J349=\"Serviço\"),2),0,1,2,3,4,\"S\")","v":"S"},{"$f":"IF(OR(A349=\"S\",A349=0),0,IF(ISERROR(I349),H349,SMALL(H349:I349,1)))","v":0},22,0,0,0,5,0,0,"Serviço",{"$f":"IF($A349=0,\"-\",CONCATENATE(C349&\".\",IF(AND($A$5>=2,$A349>=2),D349&\".\",\"\"),IF(AND($A$5>=3,$A349>=3),E349&\".\",\"\"),IF(AND($A$5>=4,$A349>=4),F349&\".\",\"\"),IF($A349=\"S\",G349&\".\",\"\")))","v":"22.0.5."},"SINAPI","88485","APLICAÇÃO DE FUNDO SELADOR ACRÍLICO EM PAREDES, UMA DEMÃO. AF_06/2014","M2",92.44,null,"BDI 1",0,0,"SEM VALOR",{"$f":"IF(OR($A349=0,$A349=\"S\",$A349>CFF!$A$9),\"\",MAX(V$12:OFFSET(V349,-1,0))+1)","v":""},"SINAPI-88485",{"$error":"#REF!"},2.19,{"$f":"ROUND(IF(ISNUMBER(R349),R349,IF(LEFT(R349,3)=\"BDI\",HLOOKUP(R349,DADOS!$T$37:$X$38,2,FALSE),0)),15-11*$X$5)","v":0.26390000000000002}]
["S",0,22,0,0,0,6,0,0,"Serviço","22.0.6.","SINAPI","88489","APLICAÇÃO MANUAL DE PINTURA COM TINTA LÁTEX ACRÍLICA EM PAREDES, DUAS DEMÃOS. AF_06/2014","M2",92.44,null,"BDI 1",0,0,"SEM VALOR",{"$f":"IF(OR($A350=0,$A350=\"S\",$A350>CFF!$A$9),\"\",MAX(V$12:OFFSET(V350,-1,0))+1)","v":""},"SINAPI-88489",{"$error":"#REF!"},13.26,{"$f":"ROUND(IF(ISNUMBER(R350),R350,IF(LEFT(R350,3)=\"BDI\",HLOOKUP(R350,DADOS!$T$37:$X$38,2,FALSE),0)),15-11*$X$5)","v":0.26390000000000002}]
["S",0,22,0,0,0,7,0,0,"Serviço","22.0.7.","COTAÇÃO","024","GRADIL MALHA MIN. 50X200MM, FIO 4,3MM, ALTURA 1,53 M, COM MONTANTES PARA CHUMBAR, FIXADOR DE NYLON (4/MONTANTE)","M",56.2,null,"BDI 1",0,0,"SEM VALOR",{"$f":"IF(OR($A351=0,$A351=\"S\",$A351>CFF!$A$9),\"\",MAX(V$12:OFFSET(V351,-1,0))+1)","v":""},"COTAÇÃO-024",{"$error":"#REF!"},252,{"$f":"ROUND(IF(ISNUMBER(R351),R351,IF(LEFT(R351,3)=\"BDI\",HLOOKUP(R351,DADOS!$T$37:$X$38,2,FALSE),0)),15-11*$X$5)","v":0.26390000000000002}]
["S",0,22,0,0,0,8,0,0,"Serviço","22.0.8.","COTAÇÃO","025","PORTÃO PIVOTANTE 2 FOLHAS, COM 1,80 M E ALTURA 2,03 M, MALHA MÍN. 50 X 200MM, FIO 4.3MM, INCLUSO FECHADURA - COMPLETO","M2",3.65,null,"BDI 1",0,0,"SEM VALOR",{"$f":"IF(OR($A352=0,$A352=\"S\",$A352>CFF!$A$9),\"\",MAX(V$12:OFFSET(V352,-1,0))+1)","v":""},"COTAÇÃO-025",{"$error":"#REF!"},722.95,{"$f":"ROUND(IF(ISNUMBER(R352),R352,IF(LEFT(R352,3)=\"BDI\",HLOOKUP(R352,DADOS!$T$37:$X$38,2,FALSE),0)),15-11*$X$5)","v":0.26390000000000002}]
["S",0,22,0,0,0,9,0,0,"Serviço","22.0.9.","COTAÇÃO","026","PORTÃO CORREDIÇO COM GRADIL, COM 3 M E ALTURA 2,03 M, MALHA MÍN. 50 X 200MM, FIO 4.3MM, INCLUSO TRILHOS, ROLDANAS - COMPLETO","M2",6.09,null,"BDI 1",0,0,"SEM VALOR",{"$f":"IF(OR($A353=0,$A353=\"S\",$A353>CFF!$A$9),\"\",MAX(V$12:OFFSET(V353,-1,0))+1)","v":""},"COTAÇÃO-026",{"$error":"#REF!"},722.95,{"$f":"ROUND(IF(ISNUMBER(R353),R353,IF(LEFT(R353,3)=\"BDI\",HLOOKUP(R353,DADOS!$T$37:$X$38,2,FALSE),0)),15-11*$X$5)","v":0.26390000000000002}]
["S",0,22,0,0,0,10,0,0,"Serviço","22.0.10.","COMP.","040","MOVIMENTADOR DESLIZANTE PARA PORTÃO (MOTOR ELÉTRICO 1/2HP, MONOFÁSICO, 220V, COM CENTRAL DE COMANDO INCORPORADA E SISTEMA ANTI CLONAGEM, CAPACITOR, 2 CONTROLES REMOTOS, BARRAS DE CREMALHEIRA GALVANIZADAS, ÍMÃS E SENSORES DE FIM DE PERCURSO, 2 CHAVES PARA DESTRAVAMENTO EM CASO DE FALTA DE ENERGIA, CAPA PROTETORA DO MOTOR, FOTOCÉLULA COM SENSOR ANTI ESMAGAMENTO E COROA METÁLICA, SUPORTES - COMPLETO) - FORNECIMENTO E INSTALAÇÃO","UN",1,null,"BDI 1",0,0,"SEM VALOR",{"$f":"IF(OR($A354=0,$A354=\"S\",$A354>CFF!$A$9),\"\",MAX(V$12:OFFSET(V354,-1,0))+1)","v":""},"COMP.-040",{"$error":"#REF!"},830.99,{"$f":"ROUND(IF(ISNUMBER(R354),R354,IF(LEFT(R354,3)=\"BDI\",HLOOKUP(R354,DADOS!$T$37:$X$38,2,FALSE),0)),15-11*$X$5)","v":0.26390000000000002}]
[1,11,23,0,0,0,0,11,{"$error":"#N/A"},"Meta","23.",null,null,"SERVIÇOS DIVERSOS","",0,null,"BDI 1",0,0,"SEM VALOR",{"$f":"IF(OR($A355=0,$A355=\"S\",$A355>CFF!$A$9),\"\",MAX(V$12:OFFSET(V355,-1,0))+1)","v":50},false,"X",0,{"$f":"ROUND(IF(ISNUMBER(R355),R355,IF(LEFT(R355,3)=\"BDI\",HLOOKUP(R355,DADOS!$T$37:$X$38,2,FALSE),0)),15-11*$X$5)","v":0.26390000000000002}]
["S",0,23,0,0,0,1,0,0,"Serviço","23.0.1.","COMP.","042","MARQUISE COM COBERTURA EM POLICARBONATO ALVEOLAR VERDE 10 MM, 2,10M x 6,0M, E ESTRUTURA METÁLICA COM PINTURA, INCLUSIVE EMENDAS E ACABAMENTOS, FIXADA NA ALVENARIA COM PARABOLT - FORNECIMENTO E INSTALAÇÃO","M²",7.14,null,"BDI 1",0,0,"SEM VALOR",{"$f":"IF(OR($A356=0,$A356=\"S\",$A356>CFF!$A$9),\"\",MAX(V$12:OFFSET(V356,-1,0))+1)","v":""},"COMP.-042",{"$error":"#REF!"},210.38,{"$f":"ROUND(IF(ISNUMBER(R356),R356,IF(LEFT(R356,3)=\"BDI\",HLOOKUP(R356,DADOS!$T$37:$X$38,2,FALSE),0)),15-11*$X$5)","v":0.26390000000000002}]
["S",0,23,0,0,0,2,0,0,"Serviço","23.0.2.","COTAÇÃO","022","PERGOLADO EM CONCRETO PRÉ-MOLDADO, COR AMADEIRADO, COM 4 PILARES 38,5 CM X 38,5 CM X 2,25 M, 4 CAPAS DE PILAR 50,5CM X 50,5CM X 12CM, 2 TERÇAS 10CM X 20CM X 5M, 7 CAIBROS 7CM X 10CM X 4M - FORNECIMENTO E INSTALAÇÃO","UN",1,null,"BDI 1",0,0,"SEM VALOR",{"$f":"IF(OR($A357=0,$A357=\"S\",$A357>CFF!$A$9),\"\",MAX(V$12:OFFSET(V357,-1,0))+1)","v":""},"COTAÇÃO-022",{"$error":"#REF!"},10743.15,{"$f":"ROUND(IF(ISNUMBER(R357),R357,IF(LEFT(R357,3)=\"BDI\",HLOOKUP(R357,DADOS!$T$37:$X$38,2,FALSE),0)),15-11*$X$5)","v":0.26390000000000002}]
["S",0,23,0,0,0,3,0,0,"Serviço","23.0.3.","COMP.","043","COBERTURA EM POLICARBONATO ALVEOLAR VERDE OU CRISTAL 10 MM E TERÇAS METÁLICAS COM PINTURA, INCLUSIVE EMENDAS E ACABAMENTOS, FIXADA NOS CAIBROS DOS PERGOLADOS - FORNECIMENTO E INSTALAÇÃO","M²",20,null,"BDI 1",0,0,"SEM VALOR",{"$f":"IF(OR($A358=0,$A358=\"S\",$A358>CFF!$A$9),\"\",MAX(V$12:OFFSET(V358,-1,0))+1)","v":""},"COMP.-043",{"$error":"#REF!"},195.96,{"$f":"ROUND(IF(ISNUMBER(R358),R358,IF(LEFT(R358,3)=\"BDI\",HLOOKUP(R358,DADOS!$T$37:$X$38,2,FALSE),0)),15-11*$X$5)","v":0.26390000000000002}]
[{"$f":"CHOOSE(1+LOG(1+2*(J359=\"Meta\")+4*(J359=\"Nível 2\")+8*(J359=\"Nível 3\")+16*(J359=\"Nível 4\")+32*(J359=\"Serviço\"),2),0,1,2,3,4,\"S\")","v":"S"},{"$f":"IF(OR(A359=\"S\",A359=0),0,IF(ISERROR(I359),H359,SMALL(H359:I359,1)))","v":0},{"$f":"IF($A359=1,OFFSET(C359,-1,0)+1,OFFSET(C359,-1,0))","v":23},{"$f":"IF($A359=1,0,IF($A359=2,OFFSET(D359,-1,0)+1,OFFSET(D359,-1,0)))","v":0},{"$f":"IF(AND($A359<=2,$A359<>0),0,IF($A359=3,OFFSET(E359,-1,0)+1,OFFSET(E359,-1,0)))","v":0},{"$f":"IF(AND($A359<=3,$A359<>0),0,IF($A359=4,OFFSET(F359,-1,0)+1,OFFSET(F359,-1,0)))","v":0},{"$f":"IF(AND($A359<=4,$A359<>0),0,IF($A359=\"S\",OFFSET(G359,-1,0)+1,OFFSET(G359,-1,0)))","v":4},{"$f":"IF(OR($A359=\"S\",$A359=0),0,MATCH(0,OFFSET($B359,1,$A359,ROW($A$366)-ROW($A359)),0))","v":0},{"$f":"IF(OR($A359=\"S\",$A359=0),0,MATCH(OFFSET($B359,0,$A359)+1,OFFSET($B359,1,$A359,ROW($A$366)-ROW($A359)),0))","v":0},"Serviço",{"$f":"IF($A359=0,\"-\",CONCATENATE(C359&\".\",IF(AND($A$5>=2,$A359>=2),D359&\".\",\"\"),IF(AND($A$5>=3,$A359>=3),E359&\".\",\"\"),IF(AND($A$5>=4,$A359>=4),F359&\".\",\"\"),IF($A359=\"S\",G359&\".\",\"\")))","v":"23.0.4."},"COTAÇÃO","023","BANCO EM CONCRETO E MADEIRA OU MADEIRA PLÁSTICA COM ENCOSTO, MEDIDAS MÍNIMAS 1,25 X 0,55 X ,70 M - FORNECIMENTO E INSTALAÇÃO","UN",5,null,"BDI 1",{"$f":"IF($A359=\"S\",IF($Q$10=\"Preço Unitário (R$)\",PO.CustoUnitario,ROUND(PO.CustoUnitario*(1+$Z359),15-13*$X$6)),0)","v":0},{"$f":"IF($A359=\"S\",VTOTAL1,IF($A359=0,0,ROUND(SomaAgrup,15-13*$X$7)))","v":0},{"$f":"IF($J359=\"\",\"\",IF($N359=\"\",\"DESCRIÇÃO\",IF(AND($J359=\"Serviço\",$O359=\"\"),\"UNIDADE\",IF($T359<=0,\"SEM VALOR\",IF(AND($Y359<>\"\",$Q359>$Y359),\"ACIMA REF.\",\"\")))))","v":"SEM VALOR"},{"$f":"IF(OR($A359=0,$A359=\"S\",$A359>CFF!$A$9),\"\",MAX(V$12:OFFSET(V359,-1,0))+1)","v":""},{"$f":"IF(AND($J359=\"Serviço\",$M359<>\"\"),IF($L359=\"\",$M359,CONCATENATE($L359,\"-\",$M359)))","v":"COTAÇÃO-023"},{"$f":"IF(AND(Fonte<>\"\",Código<>\"\"),MATCH(Fonte&\" \"&IF(Fonte=\"sinapi\",SUBSTITUTE(SUBSTITUTE(Código,\"/00\",\"/\"),\"/0\",\"/\"),Código),INDIRECT(\"'[Referência \"&_xlnm.Database&\".xls]Banco'!$a:$a\"),0),\"X\")","v":{"$error":"#REF!"}},834.17,{"$f":"ROUND(IF(ISNUMBER(R359),R359,IF(LEFT(R359,3)=\"BDI\",HLOOKUP(R359,DADOS!$T$37:$X$38,2,FALSE),0)),15-11*$X$5)","v":0.26390000000000002}]
["S",0,23,0,0,0,5,0,0,"Serviço","23.0.5.","SINAPI","98510","PLANTIO DE ÁRVORE ORNAMENTAL COM ALTURA DE MUDA MENOR OU IGUAL A 2,00 M. AF_05/2018","UN",3,null,"BDI 1",0,0,"SEM VALOR",{"$f":"IF(OR($A360=0,$A360=\"S\",$A360>CFF!$A$9),\"\",MAX(V$12:OFFSET(V360,-1,0))+1)","v":""},"SINAPI-98510",{"$error":"#REF!"},53.55,{"$f":"ROUND(IF(ISNUMBER(R360),R360,IF(LEFT(R360,3)=\"BDI\",HLOOKUP(R360,DADOS!$T$37:$X$38,2,FALSE),0)),15-11*$X$5)","v":0.26390000000000002}]
["S",0,23,0,0,0,6,0,0,"Serviço","23.0.6.","SINAPI-I","365","MUDA DE ARBUSTO FOLHAGEM, SANSAO-DO-CAMPO OU EQUIVALENTE DA REGIAO, H= *50 A 70* CM","UN",10,null,"BDI 1",0,0,"SEM VALOR",{"$f":"IF(OR($A361=0,$A361=\"S\",$A361>CFF!$A$9),\"\",MAX(V$12:OFFSET(V361,-1,0))+1)","v":""},"SINAPI-I-365",{"$error":"#REF!"},30.84,{"$f":"ROUND(IF(ISNUMBER(R361),R361,IF(LEFT(R361,3)=\"BDI\",HLOOKUP(R361,DADOS!$T$37:$X$38,2,FALSE),0)),15-11*$X$5)","v":0.26390000000000002}]
["S",0,23,0,0,0,7,0,0,"Serviço","23.0.7.","SINAPI-I","11795","GRANITO PARA BANCADA, POLIDO, TIPO ANDORINHA/ QUARTZ/ CASTELO/ CORUMBA OU OUTROS EQUIVALENTES DA REGIAO, E=  *2,5* CM","M2",1.2,null,"BDI 1",0,0,"SEM VALOR",{"$f":"IF(OR($A362=0,$A362=\"S\",$A362>CFF!$A$9),\"\",MAX(V$12:OFFSET(V362,-1,0))+1)","v":""},"SINAPI-I-11795",{"$error":"#REF!"},629.55999999999995,{"$f":"ROUND(IF(ISNUMBER(R362),R362,IF(LEFT(R362,3)=\"BDI\",HLOOKUP(R362,DADOS!$T$37:$X$38,2,FALSE),0)),15-11*$X$5)","v":0.26390000000000002}]
["S",0,23,0,0,0,8,0,0,"Serviço","23.0.8.","SINAPI","86889","BANCADA DE GRANITO CINZA POLIDO PARA PIA DE COZINHA 1,50 X 0,60 M - FORNECIMENTO E INSTALAÇÃO. AF_12/2013","UN",1,null,"BDI 1",0,0,"SEM VALOR",{"$f":"IF(OR($A363=0,$A363=\"S\",$A363>CFF!$A$9),\"\",MAX(V$12:OFFSET(V363,-1,0))+1)","v":""},"SINAPI-86889",{"$error":"#REF!"},792.79,{"$f":"ROUND(IF(ISNUMBER(R363),R363,IF(LEFT(R363,3)=\"BDI\",HLOOKUP(R363,DADOS!$T$37:$X$38,2,FALSE),0)),15-11*$X$5)","v":0.26390000000000002}]
["S",0,23,0,0,0,9,0,0,"Serviço","23.0.9.","SINAPI-I","10848","PLACA DE INAUGURACAO METALICA, *40* CM X *60* CM","UN",1,null,"BDI 1",0,0,"SEM VALOR",{"$f":"IF(OR($A364=0,$A364=\"S\",$A364>CFF!$A$9),\"\",MAX(V$12:OFFSET(V364,-1,0))+1)","v":""},"SINAPI-I-10848",{"$error":"#REF!"},914.56,{"$f":"ROUND(IF(ISNUMBER(R364),R364,IF(LEFT(R364,3)=\"BDI\",HLOOKUP(R364,DADOS!$T$37:$X$38,2,FALSE),0)),15-11*$X$5)","v":0.26390000000000002}]
["S",0,23,0,0,0,10,{"$f":"IF(OR($A365=\"S\",$A365=0),0,MATCH(0,OFFSET($B365,1,$A365,ROW($A$366)-ROW($A365)),0))","v":0},{"$f":"IF(OR($A365=\"S\",$A365=0),0,MATCH(OFFSET($B365,0,$A365)+1,OFFSET($B365,1,$A365,ROW($A$366)-ROW($A365)),0))","v":0},"Serviço","23.0.10.","SINAPI","9537","LIMPEZA FINAL DA OBRA","M2",165.3,null,"BDI 1",0,0,"SEM VALOR",{"$f":"IF(OR($A365=0,$A365=\"S\",$A365>CFF!$A$9),\"\",MAX(V$12:OFFSET(V365,-1,0))+1)","v":""},"SINAPI-9537",{"$error":"#REF!"},2.72,{"$f":"ROUND(IF(ISNUMBER(R365),R365,IF(LEFT(R365,3)=\"BDI\",HLOOKUP(R365,DADOS!$T$37:$X$38,2,FALSE),0)),15-11*$X$5)","v":0.26390000000000002}]
[-1,null,0,0,0,0,0]
[null,null,null,null,null,null,null,null,null,null,"Encargos sociais:",null,"Para elaboração deste orçamento, foram utilizados os encargos sociais do SINAPI para a Unidade da Federação indicada."]
[]
[null,null,null,null,null,null,null,null,null,null,"Observações:"]
[]
[]
[]
[]
[null,null,null,null,null,null,null,null,null,null,{"$f":"IF(AND($X$3=FALSE,$X$4=FALSE,$X$5=FALSE,$X$6=FALSE,$X$7=FALSE),\"Não foi considerado arredondamento nos valores da planilha.\",CONCATENATE(\"Foi considerado arredondamento de duas casas decimais para \",IF($X$3=TRUE,\"Quantidade; \",\"\"),IF($X$4=TRUE,\"Custo Unitário; \",\"\"),IF($X$5=TRUE,\"BDI; \",\"\"),IF($X$6=TRUE,\"Preço Unitário; \",\"\"),IF($X$7=TRUE,\"Preço Total.\",\"\")))","v":"Foi considerado arredondamento de duas casas decimais para Quantidade; Custo Unitário; BDI; Preço Unitário; Preço Total."}]
[]
[]
[null,null,null,null,null,null,null,null,null,null,{"$f":"Import.Município","v":"CASEIROS/RS"}]
[null,null,null,null,null,null,null,null,null,null,"Local"]
[]
[null,null,null,null,null,null,null,null,null,null,{"$f":"TODAY()","v":"2018-10-30"}]
[null,null,null,null,null,null,null,null,null,null,"Data"]

{"sheet":"PLQ","index":3,"n_rows":372,"n_cols":21,"rows_kept":372,"cut":false,"hidden":true,"merged":[[367,1,367,2],[370,1,370,2]]}
[null,null,null,null,"PLQ -","PLANILHA DE LEVANTAMENTO DE QUANTIDADES"]
[]
[]
[]
[]
[]
[null,null,null,null,{"$f":"OFFSET(PO!$P$12,ROW($E7)-ROW(E$12),0)","v":0}]
[]
[null,null,null,null,"-","Única"]
["Nível","Item","Descrição","Unid.","Quantidade",{"$f":"IF(OFFSET(F10,0,-1)=\"Quantidade\",1,OFFSET(F10,0,-1)+1)","v":1},2,3,4,5,6,7,8,9,10,null,null,null,null,null,{"$f":"IF(OFFSET(U10,0,-1)=\"Quantidade\",1,OFFSET(U10,0,-1)+1)","v":1}]
[{"$f":"OFFSET(PO!J$12,ROW(A11)-ROW($A$12),0)","v":"Serviço"},{"$f":"IF($A11=0,\"\",OFFSET(PO!K$12,ROW(B11)-ROW(B$12),0))","v":{"$error":"#VALUE!"}},{"$f":"IF(OFFSET(PO!N$12,ROW(C11)-ROW(C$12),0)=0,\"\",OFFSET(PO!N$12,ROW(C11)-ROW(C$12),0))","v":""},{"$f":"IF(OFFSET(PO!O$12,ROW(D11)-ROW(D$12),0)=0,\"\",OFFSET(PO!O$12,ROW(D11)-ROW(D$12),0))","v":""},{"$f":"IF($A11<>\"Serviço\",0,ROUND(SUMIF($F$9:$P$9,\"<>\",$F11:$P11),15-13*PO!$X$3))","v":0},{"$f":"OFFSET(PO!$P$12,ROW($E11)-ROW(F$12),0)","v":0}]
[{"$f":"PO!J12","v":"CTEF"},null,{"$f":"PO!N12","v":0}]
[{"$f":"OFFSET(PO!J$12,ROW(A13)-ROW($A$12),0)","v":"Meta"},{"$f":"IF($A13=0,\"\",OFFSET(PO!K$12,ROW(B13)-ROW(B$12),0))","v":"1."},{"$f":"IF(OFFSET(PO!N$12,ROW(C13)-ROW(C$12),0)=0,\"\",OFFSET(PO!N$12,ROW(C13)-ROW(C$12),0))","v":"SERVIÇOS PRELIMINARES"},{"$f":"IF(OFFSET(PO!O$12,ROW(D13)-ROW(D$12),0)=0,\"\",OFFSET(PO!O$12,ROW(D13)-ROW(D$12),0))","v":""},{"$f":"IF($A13<>\"Serviço\",0,ROUND(SUMIF($F$9:$P$9,\"<>\",$F13:$P13),15-13*PO!$X$3))","v":0},{"$f":"OFFSET(PO!$P$12,ROW($E13)-ROW(F$12),0)","v":0}]
[{"$f":"OFFSET(PO!J$12,ROW(A14)-ROW($A$12),0)","v":"Serviço"},{"$f":"IF($A14=0,\"\",OFFSET(PO!K$12,ROW(B14)-ROW(B$12),0))","v":"1.0.1."},{"$f":"IF(OFFSET(PO!N$12,ROW(C14)-ROW(C$12),0)=0,\"\",OFFSET(PO!N$12,ROW(C14)-ROW(C$12),0))","v":"PLACA DE OBRA EM CHAPA DE ACO GALVANIZADO"},{"$f":"IF(OFFSET(PO!O$12,ROW(D14)-ROW(D$12),0)=0,\"\",OFFSET(PO!O$12,ROW(D14)-ROW(D$12),0))","v":"M2"},{"$f":"IF($A14<>\"Serviço\",0,ROUND(SUMIF($F$9:$P$9,\"<>\",$F14:$P14),15-13*PO!$X$3))","v":2.5},{"$f":"OFFSET(PO!$P$12,ROW($E14)-ROW(F$12),0)","v":2.5}]
[{"$f":"OFFSET(PO!J$12,ROW(A15)-ROW($A$12),0)","v":"Serviço"},{"$f":"IF($A15=0,\"\",OFFSET(PO!K$12,ROW(B15)-ROW(B$12),0))","v":"1.0.2."},{"$f":"IF(OFFSET(PO!N$12,ROW(C15)-ROW(C$12),0)=0,\"\",OFFSET(PO!N$12,ROW(C15)-ROW(C$12),0))","v":"ENTRADA DE ENERGIA ELETRICA TRIFASICA, CONFORME PADRÃO GED 13 - RGE - FORNECIMENTO E INSTALAÇÃO"},{"$f":"IF(OFFSET(PO!O$12,ROW(D15)-ROW(D$12),0)=0,\"\",OFFSET(PO!O$12,ROW(D15)-ROW(D$12),0))","v":"UN"},{"$f":"IF($A15<>\"Serviço\",0,ROUND(SUMIF($F$9:$P$9,\"<>\",$F15:$P15),15-13*PO!$X$3))","v":1},{"$f":"OFFSET(PO!$P$12,ROW($E15)-ROW(F$12),0)","v":1}]
[{"$f":"OFFSET(PO!J$12,ROW(A16)-ROW($A$12),0)","v":"Serviço"},{"$f":"IF($A16=0,\"\",OFFSET(PO!K$12,ROW(B16)-ROW(B$12),0))","v":"1.0.3."},{"$f":"IF(OFFSET(PO!N$12,ROW(C16)-ROW(C$12),0)=0,\"\",OFFSET(PO!N$12,ROW(C16)-ROW(C$12),0))","v":"EXECUÇÃO DE DEPÓSITO EM CANTEIRO DE OBRA EM CHAPA DE MADEIRA COMPENSADA, NÃO INCLUSO MOBILIÁRIO. AF_04/2016"},{"$f":"IF(OFFSET(PO!O$12,ROW(D16)-ROW(D$12),0)=0,\"\",OFFSET(PO!O$12,ROW(D16)-ROW(D$12),0))","v":"M2"},{"$f":"IF($A16<>\"Serviço\",0,ROUND(SUMIF($F$9:$P$9,\"<>\",$F16:$P16),15-13*PO!$X$3))","v":12},{"$f":"OFFSET(PO!$P$12,ROW($E16)-ROW(F$12),0)","v":12}]
[{"$f":"OFFSET(PO!J$12,ROW(A17)-ROW($A$12),0)","v":"Serviço"},{"$f":"IF($A17=0,\"\",OFFSET(PO!K$12,ROW(B17)-ROW(B$12),0))","v":"1.0.4."},{"$f":"IF(OFFSET(PO!N$12,ROW(C17)-ROW(C$12),0)=0,\"\",OFFSET(PO!N$12,ROW(C17)-ROW(C$12),0))","v":"TAPUME DE CHAPA DE MADEIRA COMPENSADA, E= 6MM, COM PINTURA A CAL E REAPROVEITAMENTO DE 2X"},{"$f":"IF(OFFSET(PO!O$12,ROW(D17)-ROW(D$12),0)=0,\"\",OFFSET(PO!O$12,ROW(D17)-ROW(D$12),0))","v":"M2"},{"$f":"IF($A17<>\"Serviço\",0,ROUND(SUMIF($F$9:$P$9,\"<>\",$F17:$P17),15-13*PO!$X$3))","v":134.19999999999999},{"$f":"OFFSET(PO!$P$12,ROW($E17)-ROW(F$12),0)","v":134.19999999999999}]
[{"$f":"OFFSET(PO!J$12,ROW(A18)-ROW($A$12),0)","v":"Serviço"},{"$f":"IF($A18=0,\"\",OFFSET(PO!K$12,ROW(B18)-ROW(B$12),0))","v":"1.0.5."},{"$f":"IF(OFFSET(PO!N$12,ROW(C18)-ROW(C$12),0)=0,\"\",OFFSET(PO!N$12,ROW(C18)-ROW(C$12),0))","v":"LOCACAO CONVENCIONAL DE OBRA, ATRAVÉS DE GABARITO DE TABUAS CORRIDAS PONTALETADAS, COM REAPROVEITAMENTO DE 10 VEZES."},{"$f":"IF(OFFSET(PO!O$12,ROW(D18)-ROW(D$12),0)=0,\"\",OFFSET(PO!O$12,ROW(D18)-ROW(D$12),0))","v":"M2"},{"$f":"IF($A18<>\"Serviço\",0,ROUND(SUMIF($F$9:$P$9,\"<>\",$F18:$P18),15-13*PO!$X$3))","v":200},{"$f":"OFFSET(PO!$P$12,ROW($E18)-ROW(F$12),0)","v":200}]
[{"$f":"OFFSET(PO!J$12,ROW(A19)-ROW($A$12),0)","v":"Meta"},{"$f":"IF($A19=0,\"\",OFFSET(PO!K$12,ROW(B19)-ROW(B$12),0))","v":"2."},{"$f":"IF(OFFSET(PO!N$12,ROW(C19)-ROW(C$12),0)=0,\"\",OFFSET(PO!N$12,ROW(C19)-ROW(C$12),0))","v":"MOVIMENTO DE TERRA"},{"$f":"IF(OFFSET(PO!O$12,ROW(D19)-ROW(D$12),0)=0,\"\",OFFSET(PO!O$12,ROW(D19)-ROW(D$12),0))","v":""},{"$f":"IF($A19<>\"Serviço\",0,ROUND(SUMIF($F$9:$P$9,\"<>\",$F19:$P19),15-13*PO!$X$3))","v":0},{"$f":"OFFSET(PO!$P$12,ROW($E19)-ROW(F$12),0)","v":0}]
[{"$f":"OFFSET(PO!J$12,ROW(A20)-ROW($A$12),0)","v":"Serviço"},{"$f":"IF($A20=0,\"\",OFFSET(PO!K$12,ROW(B20)-ROW(B$12),0))","v":"2.0.1."},{"$f":"IF(OFFSET(PO!N$12,ROW(C20)-ROW(C$12),0)=0,\"\",OFFSET(PO!N$12,ROW(C20)-ROW(C$12),0))","v":"ESCAVAÇÃO MANUAL DE VALA COM PROFUNDIDADE MENOR OU IGUAL A 1,30 M. AF_03/2016"},{"$f":"IF(OFFSET(PO!O$12,ROW(D20)-ROW(D$12),0)=0,\"\",OFFSET(PO!O$12,ROW(D20)-ROW(D$12),0))","v":"M3"},{"$f":"IF($A20<>\"Serviço\",0,ROUND(SUMIF($F$9:$P$9,\"<>\",$F20:$P20),15-13*PO!$X$3))","v":15},{"$f":"OFFSET(PO!$P$12,ROW($E20)-ROW(F$12),0)","v":15}]
[{"$f":"OFFSET(PO!J$12,ROW(A21)-ROW($A$12),0)","v":"Serviço"},{"$f":"IF($A21=0,\"\",OFFSET(PO!K$12,ROW(B21)-ROW(B$12),0))","v":"2.0.2."},{"$f":"IF(OFFSET(PO!N$12,ROW(C21)-ROW(C$12),0)=0,\"\",OFFSET(PO!N$12,ROW(C21)-ROW(C$12),0))","v":"PREPARO DE FUNDO DE VALA COM LARGURA MENOR QUE 1,5 M, EM LOCAL COM NÍVEL BAIXO DE INTERFERÊNCIA. AF_06/2016"},{"$f":"IF(OFFSET(PO!O$12,ROW(D21)-ROW(D$12),0)=0,\"\",OFFSET(PO!O$12,ROW(D21)-ROW(D$12),0))","v":"M2"},{"$f":"IF($A21<>\"Serviço\",0,ROUND(SUMIF($F$9:$P$9,\"<>\",$F21:$P21),15-13*PO!$X$3))","v":30},{"$f":"OFFSET(PO!$P$12,ROW($E21)-ROW(F$12),0)","v":30}]
[{"$f":"OFFSET(PO!J$12,ROW(A22)-ROW($A$12),0)","v":"Serviço"},{"$f":"IF($A22=0,\"\",OFFSET(PO!K$12,ROW(B22)-ROW(B$12),0))","v":"2.0.3."},{"$f":"IF(OFFSET(PO!N$12,ROW(C22)-ROW(C$12),0)=0,\"\",OFFSET(PO!N$12,ROW(C22)-ROW(C$12),0))","v":"REATERRO MANUAL DE VALAS COM COMPACTAÇÃO MECANIZADA. AF_04/2016"},{"$f":"IF(OFFSET(PO!O$12,ROW(D22)-ROW(D$12),0)=0,\"\",OFFSET(PO!O$12,ROW(D22)-ROW(D$12),0))","v":"M3"},{"$f":"IF($A22<>\"Serviço\",0,ROUND(SUMIF($F$9:$P$9,\"<>\",$F22:$P22),15-13*PO!$X$3))","v":12.91},{"$f":"OFFSET(PO!$P$12,ROW($E22)-ROW(F$12),0)","v":12.91}]
[{"$f":"OFFSET(PO!J$12,ROW(A23)-ROW($A$12),0)","v":"Serviço"},{"$f":"IF($A23=0,\"\",OFFSET(PO!K$12,ROW(B23)-ROW(B$12),0))","v":"2.0.4."},{"$f":"IF(OFFSET(PO!N$12,ROW(C23)-ROW(C$12),0)=0,\"\",OFFSET(PO!N$12,ROW(C23)-ROW(C$12),0))","v":"REATERRO MANUAL DE VALAS COM COMPACTAÇÃO MECANIZADA. AF_04/2016"},{"$f":"IF(OFFSET(PO!O$12,ROW(D23)-ROW(D$12),0)=0,\"\",OFFSET(PO!O$12,ROW(D23)-ROW(D$12),0))","v":"M3"},{"$f":"IF($A23<>\"Serviço\",0,ROUND(SUMIF($F$9:$P$9,\"<>\",$F23:$P23),15-13*PO!$X$3))","v":33.06},{"$f":"OFFSET(PO!$P$12,ROW($E23)-ROW(F$12),0)","v":33.06}]
[{"$f":"OFFSET(PO!J$12,ROW(A24)-ROW($A$12),0)","v":"Meta"},{"$f":"IF($A24=0,\"\",OFFSET(PO!K$12,ROW(B24)-ROW(B$12),0))","v":"3."},{"$f":"IF(OFFSET(PO!N$12,ROW(C24)-ROW(C$12),0)=0,\"\",OFFSET(PO!N$12,ROW(C24)-ROW(C$12),0))","v":"INFRA-ESTRUTURA: FUNDAÇÕES"},{"$f":"IF(OFFSET(PO!O$12,ROW(D24)-ROW(D$12),0)=0,\"\",OFFSET(PO!O$12,ROW(D24)-ROW(D$12),0))","v":""},{"$f":"IF($A24<>\"Serviço\",0,ROUND(SUMIF($F$9:$P$9,\"<>\",$F24:$P24),15-13*PO!$X$3))","v":0},{"$f":"OFFSET(PO!$P$12,ROW($E24)-ROW(F$12),0)","v":0}]
[{"$f":"OFFSET(PO!J$12,ROW(A25)-ROW($A$12),0)","v":"Nível 2"},{"$f":"IF($A25=0,\"\",OFFSET(PO!K$12,ROW(B25)-ROW(B$12),0))","v":"3.1."},{"$f":"IF(OFFSET(PO!N$12,ROW(C25)-ROW(C$12),0)=0,\"\",OFFSET(PO!N$12,ROW(C25)-ROW(C$12),0))","v":"SAPATAS E \"PESCOÇO\" DOS PILARES"},{"$f":"IF(OFFSET(PO!O$12,ROW(D25)-ROW(D$12),0)=0,\"\",OFFSET(PO!O$12,ROW(D25)-ROW(D$12),0))","v":"M3"},{"$f":"IF($A25<>\"Serviço\",0,ROUND(SUMIF($F$9:$P$9,\"<>\",$F25:$P25),15-13*PO!$X$3))","v":0},{"$f":"OFFSET(PO!$P$12,ROW($E25)-ROW(F$12),0)","v":0}]
[{"$f":"OFFSET(PO!J$12,ROW(A26)-ROW($A$12),0)","v":"Serviço"},{"$f":"IF($A26=0,\"\",OFFSET(PO!K$12,ROW(B26)-ROW(B$12),0))","v":"3.1.1."},{"$f":"IF(OFFSET(PO!N$12,ROW(C26)-ROW(C$12),0)=0,\"\",OFFSET(PO!N$12,ROW(C26)-ROW(C$12),0))","v":"ESCAVAÇÃO MANUAL DE VALA COM PROFUNDIDADE MENOR OU IGUAL A 1,30 M. AF_03/2016"},{"$f":"IF(OFFSET(PO!O$12,ROW(D26)-ROW(D$12),0)=0,\"\",OFFSET(PO!O$12,ROW(D26)-ROW(D$12),0))","v":"M3"},{"$f":"IF($A26<>\"Serviço\",0,ROUND(SUMIF($F$9:$P$9,\"<>\",$F26:$P26),15-13*PO!$X$3))","v":24.26},{"$f":"OFFSET(PO!$P$12,ROW($E26)-ROW(F$12),0)","v":24.26}]
[{"$f":"OFFSET(PO!J$12,ROW(A27)-ROW($A$12),0)","v":"Serviço"},{"$f":"IF($A27=0,\"\",OFFSET(PO!K$12,ROW(B27)-ROW(B$12),0))","v":"3.1.2."},{"$f":"IF(OFFSET(PO!N$12,ROW(C27)-ROW(C$12),0)=0,\"\",OFFSET(PO!N$12,ROW(C27)-ROW(C$12),0))","v":"PREPARO DE FUNDO DE VALA  COM LARGURA MENOR QUE 1,5 M, EM LOCAL COM NÍVEL ALTO DE INTERFERÊNCIA. AF_06/2016"},{"$f":"IF(OFFSET(PO!O$12,ROW(D27)-ROW(D$12),0)=0,\"\",OFFSET(PO!O$12,ROW(D27)-ROW(D$12),0))","v":"M2"},{"$f":"IF($A27<>\"Serviço\",0,ROUND(SUMIF($F$9:$P$9,\"<>\",$F27:$P27),15-13*PO!$X$3))","v":39.89},{"$f":"OFFSET(PO!$P$12,ROW($E27)-ROW(F$12),0)","v":39.89}]
[{"$f":"OFFSET(PO!J$12,ROW(A28)-ROW($A$12),0)","v":"Serviço"},{"$f":"IF($A28=0,\"\",OFFSET(PO!K$12,ROW(B28)-ROW(B$12),0))","v":"3.1.3."},{"$f":"IF(OFFSET(PO!N$12,ROW(C28)-ROW(C$12),0)=0,\"\",OFFSET(PO!N$12,ROW(C28)-ROW(C$12),0))","v":"LASTRO DE CONCRETO MAGRO, APLICADO EM BLOCOS DE COROAMENTO OU SAPATAS, ESPESSURA DE 3 CM. AF_08/2017"},{"$f":"IF(OFFSET(PO!O$12,ROW(D28)-ROW(D$12),0)=0,\"\",OFFSET(PO!O$12,ROW(D28)-ROW(D$12),0))","v":"M2"},{"$f":"IF($A28<>\"Serviço\",0,ROUND(SUMIF($F$9:$P$9,\"<>\",$F28:$P28),15-13*PO!$X$3))","v":39.89},{"$f":"OFFSET(PO!$P$12,ROW($E28)-ROW(F$12),0)","v":39.89}]
[{"$f":"OFFSET(PO!J$12,ROW(A29)-ROW($A$12),0)","v":"Serviço"},{"$f":"IF($A29=0,\"\",OFFSET(PO!K$12,ROW(B29)-ROW(B$12),0))","v":"3.1.4."},{"$f":"IF(OFFSET(PO!N$12,ROW(C29)-ROW(C$12),0)=0,\"\",OFFSET(PO!N$12,ROW(C29)-ROW(C$12),0))","v":"FABRICAÇÃO, MONTAGEM E DESMONTAGEM DE FÔRMA PARA SAPATA, EM MADEIRA SERRADA, E=25 MM, 4 UTILIZAÇÕES. AF_06/2017"},{"$f":"IF(OFFSET(PO!O$12,ROW(D29)-ROW(D$12),0)=0,\"\",OFFSET(PO!O$12,ROW(D29)-ROW(D$12),0))","v":"M2"},{"$f":"IF($A29<>\"Serviço\",0,ROUND(SUMIF($F$9:$P$9,\"<>\",$F29:$P29),15-13*PO!$X$3))","v":37.659999999999997},{"$f":"OFFSET(PO!$P$12,ROW($E29)-ROW(F$12),0)","v":37.659999999999997}]
[{"$f":"OFFSET(PO!J$12,ROW(A30)-ROW($A$12),0)","v":"Serviço"},{"$f":"IF($A30=0,\"\",OFFSET(PO!K$12,ROW(B30)-ROW(B$12),0))","v":"3.1.5."},{"$f":"IF(OFFSET(PO!N$12,ROW(C30)-ROW(C$12),0)=0,\"\",OFFSET(PO!N$12,ROW(C30)-ROW(C$12),0))","v":"CONCRETAGEM DE SAPATAS, FCK 25 MPA, COM USO DE BOMBA ? LANÇAMENTO, ADENSAMENTO E ACABAMENTO"},{"$f":"IF(OFFSET(PO!O$12,ROW(D30)-ROW(D$12),0)=0,\"\",OFFSET(PO!O$12,ROW(D30)-ROW(D$12),0))","v":"M3"},{"$f":"IF($A30<>\"Serviço\",0,ROUND(SUMIF($F$9:$P$9,\"<>\",$F30:$P30),15-13*PO!$X$3))","v":13.53},{"$f":"OFFSET(PO!$P$12,ROW($E30)-ROW(F$12),0)","v":13.53}]
[{"$f":"OFFSET(PO!J$12,ROW(A31)-ROW($A$12),0)","v":"Serviço"},{"$f":"IF($A31=0,\"\",OFFSET(PO!K$12,ROW(B31)-ROW(B$12),0))","v":"3.1.6."},{"$f":"IF(OFFSET(PO!N$12,ROW(C31)-ROW(C$12),0)=0,\"\",OFFSET(PO!N$12,ROW(C31)-ROW(C$12),0))","v":"ARMAÇÃO DE BLOCO, VIGA BALDRAME E SAPATA UTILIZANDO AÇO CA-60 DE 5 MM - MONTAGEM. AF_06/2017"},{"$f":"IF(OFFSET(PO!O$12,ROW(D31)-ROW(D$12),0)=0,\"\",OFFSET(PO!O$12,ROW(D31)-ROW(D$12),0))","v":"KG"},{"$f":"IF($A31<>\"Serviço\",0,ROUND(SUMIF($F$9:$P$9,\"<>\",$F31:$P31),15-13*PO!$X$3))","v":17.100000000000001},{"$f":"OFFSET(PO!$P$12,ROW($E31)-ROW(F$12),0)","v":17.100000000000001}]
[{"$f":"OFFSET(PO!J$12,ROW(A32)-ROW($A$12),0)","v":"Serviço"},{"$f":"IF($A32=0,\"\",OFFSET(PO!K$12,ROW(B32)-ROW(B$12),0))","v":"3.1.7."},{"$f":"IF(OFFSET(PO!N$12,ROW(C32)-ROW(C$12),0)=0,\"\",OFFSET(PO!N$12,ROW(C32)-ROW(C$12),0))","v":"ARMAÇÃO DE BLOCO, VIGA BALDRAME OU SAPATA UTILIZANDO AÇO CA-50 DE 6,3 MM - MONTAGEM. AF_06/2017"},{"$f":"IF(OFFSET(PO!O$12,ROW(D32)-ROW(D$12),0)=0,\"\",OFFSET(PO!O$12,ROW(D32)-ROW(D$12),0))","v":"KG"},{"$f":"IF($A32<>\"Serviço\",0,ROUND(SUMIF($F$9:$P$9,\"<>\",$F32:$P32),15-13*PO!$X$3))","v":18.18},{"$f":"OFFSET(PO!$P$12,ROW($E32)-ROW(F$12),0)","v":18.18}]
[{"$f":"OFFSET(PO!J$12,ROW(A33)-ROW($A$12),0)","v":"Serviço"},{"$f":"IF($A33=0,\"\",OFFSET(PO!K$12,ROW(B33)-ROW(B$12),0))","v":"3.1.8."},{"$f":"IF(OFFSET(PO!N$12,ROW(C33)-ROW(C$12),0)=0,\"\",OFFSET(PO!N$12,ROW(C33)-ROW(C$12),0))","v":"ARMAÇÃO DE BLOCO, VIGA BALDRAME OU SAPATA UTILIZANDO AÇO CA-50 DE 8 MM - MONTAGEM. AF_06/2017"},{"$f":"IF(OFFSET(PO!O$12,ROW(D33)-ROW(D$12),0)=0,\"\",OFFSET(PO!O$12,ROW(D33)-ROW(D$12),0))","v":"KG"},{"$f":"IF($A33<>\"Serviço\",0,ROUND(SUMIF($F$9:$P$9,\"<>\",$F33:$P33),15-13*PO!$X$3))","v":121.23},{"$f":"OFFSET(PO!$P$12,ROW($E33)-ROW(F$12),0)","v":121.23}]
[{"$f":"OFFSET(PO!J$12,ROW(A34)-ROW($A$12),0)","v":"Serviço"},{"$f":"IF($A34=0,\"\",OFFSET(PO!K$12,ROW(B34)-ROW(B$12),0))","v":"3.1.9."},{"$f":"IF(OFFSET(PO!N$12,ROW(C34)-ROW(C$12),0)=0,\"\",OFFSET(PO!N$12,ROW(C34)-ROW(C$12),0))","v":"ARMAÇÃO DE BLOCO, VIGA BALDRAME OU SAPATA UTILIZANDO AÇO CA-50 DE 10 MM - MONTAGEM. AF_06/2017"},{"$f":"IF(OFFSET(PO!O$12,ROW(D34)-ROW(D$12),0)=0,\"\",OFFSET(PO!O$12,ROW(D34)-ROW(D$12),0))","v":"KG"},{"$f":"IF($A34<>\"Serviço\",0,ROUND(SUMIF($F$9:$P$9,\"<>\",$F34:$P34),15-13*PO!$X$3))","v":356.31},{"$f":"OFFSET(PO!$P$12,ROW($E34)-ROW(F$12),0)","v":356.31}]
[{"$f":"OFFSET(PO!J$12,ROW(A35)-ROW($A$12),0)","v":"Serviço"},{"$f":"IF($A35=0,\"\",OFFSET(PO!K$12,ROW(B35)-ROW(B$12),0))","v":"3.1.10."},{"$f":"IF(OFFSET(PO!N$12,ROW(C35)-ROW(C$12),0)=0,\"\",OFFSET(PO!N$12,ROW(C35)-ROW(C$12),0))","v":"ARMAÇÃO DE BLOCO, VIGA BALDRAME OU SAPATA UTILIZANDO AÇO CA-50 DE 12,5 MM - MONTAGEM. AF_06/2017"},{"$f":"IF(OFFSET(PO!O$12,ROW(D35)-ROW(D$12),0)=0,\"\",OFFSET(PO!O$12,ROW(D35)-ROW(D$12),0))","v":"KG"},{"$f":"IF($A35<>\"Serviço\",0,ROUND(SUMIF($F$9:$P$9,\"<>\",$F35:$P35),15-13*PO!$X$3))","v":138.78},{"$f":"OFFSET(PO!$P$12,ROW($E35)-ROW(F$12),0)","v":138.78}]
[{"$f":"OFFSET(PO!J$12,ROW(A36)-ROW($A$12),0)","v":"Serviço"},{"$f":"IF($A36=0,\"\",OFFSET(PO!K$12,ROW(B36)-ROW(B$12),0))","v":"3.1.11."},{"$f":"IF(OFFSET(PO!N$12,ROW(C36)-ROW(C$12),0)=0,\"\",OFFSET(PO!N$12,ROW(C36)-ROW(C$12),0))","v":"REATERRO MANUAL DE VALAS COM COMPACTAÇÃO MECANIZADA. AF_04/2016"},{"$f":"IF(OFFSET(PO!O$12,ROW(D36)-ROW(D$12),0)=0,\"\",OFFSET(PO!O$12,ROW(D36)-ROW(D$12),0))","v":"M3"},{"$f":"IF($A36<>\"Serviço\",0,ROUND(SUMIF($F$9:$P$9,\"<>\",$F36:$P36),15-13*PO!$X$3))","v":10.73},{"$f":"OFFSET(PO!$P$12,ROW($E36)-ROW(F$12),0)","v":10.73}]
[{"$f":"OFFSET(PO!J$12,ROW(A37)-ROW($A$12),0)","v":"Nível 2"},{"$f":"IF($A37=0,\"\",OFFSET(PO!K$12,ROW(B37)-ROW(B$12),0))","v":"3.2."},{"$f":"IF(OFFSET(PO!N$12,ROW(C37)-ROW(C$12),0)=0,\"\",OFFSET(PO!N$12,ROW(C37)-ROW(C$12),0))","v":"VIGAS BALDRAME"},{"$f":"IF(OFFSET(PO!O$12,ROW(D37)-ROW(D$12),0)=0,\"\",OFFSET(PO!O$12,ROW(D37)-ROW(D$12),0))","v":""},{"$f":"IF($A37<>\"Serviço\",0,ROUND(SUMIF($F$9:$P$9,\"<>\",$F37:$P37),15-13*PO!$X$3))","v":0},{"$f":"OFFSET(PO!$P$12,ROW($E37)-ROW(F$12),0)","v":0}]
[{"$f":"OFFSET(PO!J$12,ROW(A38)-ROW($A$12),0)","v":"Serviço"},{"$f":"IF($A38=0,\"\",OFFSET(PO!K$12,ROW(B38)-ROW(B$12),0))","v":"3.2.1."},{"$f":"IF(OFFSET(PO!N$12,ROW(C38)-ROW(C$12),0)=0,\"\",OFFSET(PO!N$12,ROW(C38)-ROW(C$12),0))","v":"ESCAVAÇÃO MANUAL DE VALA COM PROFUNDIDADE MENOR OU IGUAL A 1,30 M. AF_03/2016"},{"$f":"IF(OFFSET(PO!O$12,ROW(D38)-ROW(D$12),0)=0,\"\",OFFSET(PO!O$12,ROW(D38)-ROW(D$12),0))","v":"M3"},{"$f":"IF($A38<>\"Serviço\",0,ROUND(SUMIF($F$9:$P$9,\"<>\",$F38:$P38),15-13*PO!$X$3))","v":16.739999999999998},{"$f":"OFFSET(PO!$P$12,ROW($E38)-ROW(F$12),0)","v":16.739999999999998}]
[{"$f":"OFFSET(PO!J$12,ROW(A39)-ROW($A$12),0)","v":"Serviço"},{"$f":"IF($A39=0,\"\",OFFSET(PO!K$12,ROW(B39)-ROW(B$12),0))","v":"3.2.2."},{"$f":"IF(OFFSET(PO!N$12,ROW(C39)-ROW(C$12),0)=0,\"\",OFFSET(PO!N$12,ROW(C39)-ROW(C$12),0))","v":"PREPARO DE FUNDO DE VALA  COM LARGURA MENOR QUE 1,5 M, EM LOCAL COM NÍVEL ALTO DE INTERFERÊNCIA. AF_06/2016"},{"$f":"IF(OFFSET(PO!O$12,ROW(D39)-ROW(D$12),0)=0,\"\",OFFSET(PO!O$12,ROW(D39)-ROW(D$12),0))","v":"M2"},{"$f":"IF($A39<>\"Serviço\",0,ROUND(SUMIF($F$9:$P$9,\"<>\",$F39:$P39),15-13*PO!$X$3))","v":25.75},{"$f":"OFFSET(PO!$P$12,ROW($E39)-ROW(F$12),0)","v":25.75}]
[{"$f":"OFFSET(PO!J$12,ROW(A40)-ROW($A$12),0)","v":"Serviço"},{"$f":"IF($A40=0,\"\",OFFSET(PO!K$12,ROW(B40)-ROW(B$12),0))","v":"3.2.3."},{"$f":"IF(OFFSET(PO!N$12,ROW(C40)-ROW(C$12),0)=0,\"\",OFFSET(PO!N$12,ROW(C40)-ROW(C$12),0))","v":"LASTRO DE CONCRETO MAGRO, APLICADO EM BLOCOS DE COROAMENTO OU SAPATAS, ESPESSURA DE 3 CM. AF_08/2017"},{"$f":"IF(OFFSET(PO!O$12,ROW(D40)-ROW(D$12),0)=0,\"\",OFFSET(PO!O$12,ROW(D40)-ROW(D$12),0))","v":"M2"},{"$f":"IF($A40<>\"Serviço\",0,ROUND(SUMIF($F$9:$P$9,\"<>\",$F40:$P40),15-13*PO!$X$3))","v":25.75},{"$f":"OFFSET(PO!$P$12,ROW($E40)-ROW(F$12),0)","v":25.75}]
[{"$f":"OFFSET(PO!J$12,ROW(A41)-ROW($A$12),0)","v":"Serviço"},{"$f":"IF($A41=0,\"\",OFFSET(PO!K$12,ROW(B41)-ROW(B$12),0))","v":"3.2.4."},{"$f":"IF(OFFSET(PO!N$12,ROW(C41)-ROW(C$12),0)=0,\"\",OFFSET(PO!N$12,ROW(C41)-ROW(C$12),0))","v":"FABRICAÇÃO, MONTAGEM E DESMONTAGEM DE FÔRMA PARA VIGA BALDRAME, EM MADEIRA SERRADA, E=25 MM, 4 UTILIZAÇÕES. AF_06/2017"},{"$f":"IF(OFFSET(PO!O$12,ROW(D41)-ROW(D$12),0)=0,\"\",OFFSET(PO!O$12,ROW(D41)-ROW(D$12),0))","v":"M2"},{"$f":"IF($A41<>\"Serviço\",0,ROUND(SUMIF($F$9:$P$9,\"<>\",$F41:$P41),15-13*PO!$X$3))","v":77.25},{"$f":"OFFSET(PO!$P$12,ROW($E41)-ROW(F$12),0)","v":77.25}]
[{"$f":"OFFSET(PO!J$12,ROW(A42)-ROW($A$12),0)","v":"Serviço"},{"$f":"IF($A42=0,\"\",OFFSET(PO!K$12,ROW(B42)-ROW(B$12),0))","v":"3.2.5."},{"$f":"IF(OFFSET(PO!N$12,ROW(C42)-ROW(C$12),0)=0,\"\",OFFSET(PO!N$12,ROW(C42)-ROW(C$12),0))","v":"CONCRETAGEM DE BLOCOS DE VIGAS BALDRAMES, FCK 25 MPA, COM USO DE BOMBA ? LANÇAMENTO, ADENSAMENTO E ACABAMENTO"},{"$f":"IF(OFFSET(PO!O$12,ROW(D42)-ROW(D$12),0)=0,\"\",OFFSET(PO!O$12,ROW(D42)-ROW(D$12),0))","v":"M3"},{"$f":"IF($A42<>\"Serviço\",0,ROUND(SUMIF($F$9:$P$9,\"<>\",$F42:$P42),15-13*PO!$X$3))","v":7.73},{"$f":"OFFSET(PO!$P$12,ROW($E42)-ROW(F$12),0)","v":7.73}]
[{"$f":"OFFSET(PO!J$12,ROW(A43)-ROW($A$12),0)","v":"Serviço"},{"$f":"IF($A43=0,\"\",OFFSET(PO!K$12,ROW(B43)-ROW(B$12),0))","v":"3.2.6."},{"$f":"IF(OFFSET(PO!N$12,ROW(C43)-ROW(C$12),0)=0,\"\",OFFSET(PO!N$12,ROW(C43)-ROW(C$12),0))","v":"ARMAÇÃO DE BLOCO, VIGA BALDRAME E SAPATA UTILIZANDO AÇO CA-60 DE 5 MM - MONTAGEM. AF_06/2017"},{"$f":"IF(OFFSET(PO!O$12,ROW(D43)-ROW(D$12),0)=0,\"\",OFFSET(PO!O$12,ROW(D43)-ROW(D$12),0))","v":"KG"},{"$f":"IF($A43<>\"Serviço\",0,ROUND(SUMIF($F$9:$P$9,\"<>\",$F43:$P43),15-13*PO!$X$3))","v":116.28},{"$f":"OFFSET(PO!$P$12,ROW($E43)-ROW(F$12),0)","v":116.28}]
[{"$f":"OFFSET(PO!J$12,ROW(A44)-ROW($A$12),0)","v":"Serviço"},{"$f":"IF($A44=0,\"\",OFFSET(PO!K$12,ROW(B44)-ROW(B$12),0))","v":"3.2.7."},{"$f":"IF(OFFSET(PO!N$12,ROW(C44)-ROW(C$12),0)=0,\"\",OFFSET(PO!N$12,ROW(C44)-ROW(C$12),0))","v":"ARMAÇÃO DE BLOCO, VIGA BALDRAME OU SAPATA UTILIZANDO AÇO CA-50 DE 8 MM - MONTAGEM. AF_06/2017"},{"$f":"IF(OFFSET(PO!O$12,ROW(D44)-ROW(D$12),0)=0,\"\",OFFSET(PO!O$12,ROW(D44)-ROW(D$12),0))","v":"KG"},{"$f":"IF($A44<>\"Serviço\",0,ROUND(SUMIF($F$9:$P$9,\"<>\",$F44:$P44),15-13*PO!$X$3))","v":201.87},{"$f":"OFFSET(PO!$P$12,ROW($E44)-ROW(F$12),0)","v":201.87}]
[{"$f":"OFFSET(PO!J$12,ROW(A45)-ROW($A$12),0)","v":"Serviço"},{"$f":"IF($A45=0,\"\",OFFSET(PO!K$12,ROW(B45)-ROW(B$12),0))","v":"3.2.8."},{"$f":"IF(OFFSET(PO!N$12,ROW(C45)-ROW(C$12),0)=0,\"\",OFFSET(PO!N$12,ROW(C45)-ROW(C$12),0))","v":"ARMAÇÃO DE BLOCO, VIGA BALDRAME OU SAPATA UTILIZANDO AÇO CA-50 DE 10 MM - MONTAGEM. AF_06/2017"},{"$f":"IF(OFFSET(PO!O$12,ROW(D45)-ROW(D$12),0)=0,\"\",OFFSET(PO!O$12,ROW(D45)-ROW(D$12),0))","v":"KG"},{"$f":"IF($A45<>\"Serviço\",0,ROUND(SUMIF($F$9:$P$9,\"<>\",$F45:$P45),15-13*PO!$X$3))","v":20.61},{"$f":"OFFSET(PO!$P$12,ROW($E45)-ROW(F$12),0)","v":20.61}]
[{"$f":"OFFSET(PO!J$12,ROW(A46)-ROW($A$12),0)","v":"Serviço"},{"$f":"IF($A46=0,\"\",OFFSET(PO!K$12,ROW(B46)-ROW(B$12),0))","v":"3.2.9."},{"$f":"IF(OFFSET(PO!N$12,ROW(C46)-ROW(C$12),0)=0,\"\",OFFSET(PO!N$12,ROW(C46)-ROW(C$12),0))","v":"REATERRO MANUAL DE VALAS COM COMPACTAÇÃO MECANIZADA. AF_04/2016"},{"$f":"IF(OFFSET(PO!O$12,ROW(D46)-ROW(D$12),0)=0,\"\",OFFSET(PO!O$12,ROW(D46)-ROW(D$12),0))","v":"M3"},{"$f":"IF($A46<>\"Serviço\",0,ROUND(SUMIF($F$9:$P$9,\"<>\",$F46:$P46),15-13*PO!$X$3))","v":9.01},{"$f":"OFFSET(PO!$P$12,ROW($E46)-ROW(F$12),0)","v":9.01}]
[{"$f":"OFFSET(PO!J$12,ROW(A47)-ROW($A$12),0)","v":"Meta"},{"$f":"IF($A47=0,\"\",OFFSET(PO!K$12,ROW(B47)-ROW(B$12),0))","v":"4."},{"$f":"IF(OFFSET(PO!N$12,ROW(C47)-ROW(C$12),0)=0,\"\",OFFSET(PO!N$12,ROW(C47)-ROW(C$12),0))","v":"SUPERESTRUTURA"},{"$f":"IF(OFFSET(PO!O$12,ROW(D47)-ROW(D$12),0)=0,\"\",OFFSET(PO!O$12,ROW(D47)-ROW(D$12),0))","v":""},{"$f":"IF($A47<>\"Serviço\",0,ROUND(SUMIF($F$9:$P$9,\"<>\",$F47:$P47),15-13*PO!$X$3))","v":0},{"$f":"OFFSET(PO!$P$12,ROW($E47)-ROW(F$12),0)","v":0}]
[{"$f":"OFFSET(PO!J$12,ROW(A48)-ROW($A$12),0)","v":"Nível 2"},{"$f":"IF($A48=0,\"\",OFFSET(PO!K$12,ROW(B48)-ROW(B$12),0))","v":"4.1."},{"$f":"IF(OFFSET(PO!N$12,ROW(C48)-ROW(C$12),0)=0,\"\",OFFSET(PO!N$12,ROW(C48)-ROW(C$12),0))","v":"PILARES - TÉRREO"},{"$f":"IF(OFFSET(PO!O$12,ROW(D48)-ROW(D$12),0)=0,\"\",OFFSET(PO!O$12,ROW(D48)-ROW(D$12),0))","v":""},{"$f":"IF($A48<>\"Serviço\",0,ROUND(SUMIF($F$9:$P$9,\"<>\",$F48:$P48),15-13*PO!$X$3))","v":0},{"$f":"OFFSET(PO!$P$12,ROW($E48)-ROW(F$12),0)","v":0}]
[{"$f":"OFFSET(PO!J$12,ROW(A49)-ROW($A$12),0)","v":"Serviço"},{"$f":"IF($A49=0,\"\",OFFSET(PO!K$12,ROW(B49)-ROW(B$12),0))","v":"4.1.1."},{"$f":"IF(OFFSET(PO!N$12,ROW(C49)-ROW(C$12),0)=0,\"\",OFFSET(PO!N$12,ROW(C49)-ROW(C$12),0))","v":"MONTAGEM E DESMONTAGEM DE FÔRMA DE PILARES RETANGULARES E ESTRUTURAS SIMILARES COM ÁREA MÉDIA DAS SEÇÕES MENOR OU IGUAL A 0,25 M², PÉ-DIREITO SIMPLES, EM CHAPA DE MADEIRA COMPENSADA PLASTIFICADA, 12 UTILIZAÇÕES. AF_12/2015"},{"$f":"IF(OFFSET(PO!O$12,ROW(D49)-ROW(D$12),0)=0,\"\",OFFSET(PO!O$12,ROW(D49)-ROW(D$12),0))","v":"M2"},{"$f":"IF($A49<>\"Serviço\",0,ROUND(SUMIF($F$9:$P$9,\"<>\",$F49:$P49),15-13*PO!$X$3))","v":39.75},{"$f":"OFFSET(PO!$P$12,ROW($E49)-ROW(F$12),0)","v":39.75}]
[{"$f":"OFFSET(PO!J$12,ROW(A50)-ROW($A$12),0)","v":"Serviço"},{"$f":"IF($A50=0,\"\",OFFSET(PO!K$12,ROW(B50)-ROW(B$12),0))","v":"4.1.2."},{"$f":"IF(OFFSET(PO!N$12,ROW(C50)-ROW(C$12),0)=0,\"\",OFFSET(PO!N$12,ROW(C50)-ROW(C$12),0))","v":"CONCRETAGEM DE PILARES, FCK = 25 MPA, COM USO DE BOMBA EM EDIFICAÇÃO COM SEÇÃO MÉDIA DE PILARES MENOR OU IGUAL A 0,25 M² - LANÇAMENTO, ADENSAMENTO E ACABAMENTO. AF_12/2015"},{"$f":"IF(OFFSET(PO!O$12,ROW(D50)-ROW(D$12),0)=0,\"\",OFFSET(PO!O$12,ROW(D50)-ROW(D$12),0))","v":"M3"},{"$f":"IF($A50<>\"Serviço\",0,ROUND(SUMIF($F$9:$P$9,\"<>\",$F50:$P50),15-13*PO!$X$3))","v":2.58},{"$f":"OFFSET(PO!$P$12,ROW($E50)-ROW(F$12),0)","v":2.58}]
[{"$f":"OFFSET(PO!J$12,ROW(A51)-ROW($A$12),0)","v":"Serviço"},{"$f":"IF($A51=0,\"\",OFFSET(PO!K$12,ROW(B51)-ROW(B$12),0))","v":"4.1.3."},{"$f":"IF(OFFSET(PO!N$12,ROW(C51)-ROW(C$12),0)=0,\"\",OFFSET(PO!N$12,ROW(C51)-ROW(C$12),0))","v":"ARMAÇÃO DE PILAR OU VIGA DE UMA ESTRUTURA CONVENCIONAL DE CONCRETO ARMADO EM UMA EDIFICAÇÃO TÉRREA OU SOBRADO UTILIZANDO AÇO CA-60 DE 5,0 MM - MONTAGEM. AF_12/2015"},{"$f":"IF(OFFSET(PO!O$12,ROW(D51)-ROW(D$12),0)=0,\"\",OFFSET(PO!O$12,ROW(D51)-ROW(D$12),0))","v":"KG"},{"$f":"IF($A51<>\"Serviço\",0,ROUND(SUMIF($F$9:$P$9,\"<>\",$F51:$P51),15-13*PO!$X$3))","v":75.959999999999994},{"$f":"OFFSET(PO!$P$12,ROW($E51)-ROW(F$12),0)","v":75.959999999999994}]
[{"$f":"OFFSET(PO!J$12,ROW(A52)-ROW($A$12),0)","v":"Serviço"},{"$f":"IF($A52=0,\"\",OFFSET(PO!K$12,ROW(B52)-ROW(B$12),0))","v":"4.1.4."},{"$f":"IF(OFFSET(PO!N$12,ROW(C52)-ROW(C$12),0)=0,\"\",OFFSET(PO!N$12,ROW(C52)-ROW(C$12),0))","v":"ARMAÇÃO DE PILAR OU VIGA DE UMA ESTRUTURA CONVENCIONAL DE CONCRETO ARMADO EM UMA EDIFICAÇÃO TÉRREA OU SOBRADO UTILIZANDO AÇO CA-50 DE 10,0 MM - MONTAGEM. AF_12/2015"},{"$f":"IF(OFFSET(PO!O$12,ROW(D52)-ROW(D$12),0)=0,\"\",OFFSET(PO!O$12,ROW(D52)-ROW(D$12),0))","v":"KG"},{"$f":"IF($A52<>\"Serviço\",0,ROUND(SUMIF($F$9:$P$9,\"<>\",$F52:$P52),15-13*PO!$X$3))","v":225.36},{"$f":"OFFSET(PO!$P$12,ROW($E52)-ROW(F$12),0)","v":225.36}]
[{"$f":"OFFSET(PO!J$12,ROW(A53)-ROW($A$12),0)","v":"Serviço"},{"$f":"IF($A53=0,\"\",OFFSET(PO!K$12,ROW(B53)-ROW(B$12),0))","v":"4.1.5."},{"$f":"IF(OFFSET(PO!N$12,ROW(C53)-ROW(C$12),0)=0,\"\",OFFSET(PO!N$12,ROW(C53)-ROW(C$12),0))","v":"ARMAÇÃO DE PILAR OU VIGA DE UMA ESTRUTURA CONVENCIONAL DE CONCRETO ARMADO EM UMA EDIFICAÇÃO TÉRREA OU SOBRADO UTILIZANDO AÇO CA-50 DE 12,5 MM - MONTAGEM. AF_12/2015"},{"$f":"IF(OFFSET(PO!O$12,ROW(D53)-ROW(D$12),0)=0,\"\",OFFSET(PO!O$12,ROW(D53)-ROW(D$12),0))","v":"KG"},{"$f":"IF($A53<>\"Serviço\",0,ROUND(SUMIF($F$9:$P$9,\"<>\",$F53:$P53),15-13*PO!$X$3))","v":18.63},{"$f":"OFFSET(PO!$P$12,ROW($E53)-ROW(F$12),0)","v":18.63}]
[{"$f":"OFFSET(PO!J$12,ROW(A54)-ROW($A$12),0)","v":"Nível 2"},{"$f":"IF($A54=0,\"\",OFFSET(PO!K$12,ROW(B54)-ROW(B$12),0))","v":"4.2."},{"$f":"IF(OFFSET(PO!N$12,ROW(C54)-ROW(C$12),0)=0,\"\",OFFSET(PO!N$12,ROW(C54)-ROW(C$12),0))","v":"VIGAS TÉRREO"},{"$f":"IF(OFFSET(PO!O$12,ROW(D54)-ROW(D$12),0)=0,\"\",OFFSET(PO!O$12,ROW(D54)-ROW(D$12),0))","v":""},{"$f":"IF($A54<>\"Serviço\",0,ROUND(SUMIF($F$9:$P$9,\"<>\",$F54:$P54),15-13*PO!$X$3))","v":0},{"$f":"OFFSET(PO!$P$12,ROW($E54)-ROW(F$12),0)","v":0}]
[{"$f":"OFFSET(PO!J$12,ROW(A55)-ROW($A$12),0)","v":"Serviço"},{"$f":"IF($A55=0,\"\",OFFSET(PO!K$12,ROW(B55)-ROW(B$12),0))","v":"4.2.1."},{"$f":"IF(OFFSET(PO!N$12,ROW(C55)-ROW(C$12),0)=0,\"\",OFFSET(PO!N$12,ROW(C55)-ROW(C$12),0))","v":"MONTAGEM E DESMONTAGEM DE FÔRMA DE VIGA, ESCORAMENTO COM GARFO DE MADEIRA, PÉ-DIREITO SIMPLES, EM CHAPA DE MADEIRA PLASTIFICADA, 18 UTILIZAÇÕES. AF_12/2015"},{"$f":"IF(OFFSET(PO!O$12,ROW(D55)-ROW(D$12),0)=0,\"\",OFFSET(PO!O$12,ROW(D55)-ROW(D$12),0))","v":"M2"},{"$f":"IF($A55<>\"Serviço\",0,ROUND(SUMIF($F$9:$P$9,\"<>\",$F55:$P55),15-13*PO!$X$3))","v":94.03},{"$f":"OFFSET(PO!$P$12,ROW($E55)-ROW(F$12),0)","v":94.03}]
[{"$f":"OFFSET(PO!J$12,ROW(A56)-ROW($A$12),0)","v":"Serviço"},{"$f":"IF($A56=0,\"\",OFFSET(PO!K$12,ROW(B56)-ROW(B$12),0))","v":"4.2.2."},{"$f":"IF(OFFSET(PO!N$12,ROW(C56)-ROW(C$12),0)=0,\"\",OFFSET(PO!N$12,ROW(C56)-ROW(C$12),0))","v":"CONCRETAGEM DE VIGAS E LAJES, FCK=25 MPA - LANÇAMENTO, ADENSAMENTO E ACABAMENTO"},{"$f":"IF(OFFSET(PO!O$12,ROW(D56)-ROW(D$12),0)=0,\"\",OFFSET(PO!O$12,ROW(D56)-ROW(D$12),0))","v":"M3"},{"$f":"IF($A56<>\"Serviço\",0,ROUND(SUMIF($F$9:$P$9,\"<>\",$F56:$P56),15-13*PO!$X$3))","v":6.53},{"$f":"OFFSET(PO!$P$12,ROW($E56)-ROW(F$12),0)","v":6.53}]
[{"$f":"OFFSET(PO!J$12,ROW(A57)-ROW($A$12),0)","v":"Serviço"},{"$f":"IF($A57=0,\"\",OFFSET(PO!K$12,ROW(B57)-ROW(B$12),0))","v":"4.2.3."},{"$f":"IF(OFFSET(PO!N$12,ROW(C57)-ROW(C$12),0)=0,\"\",OFFSET(PO!N$12,ROW(C57)-ROW(C$12),0))","v":"ARMAÇÃO DE PILAR OU VIGA DE UMA ESTRUTURA CONVENCIONAL DE CONCRETO ARMADO EM UMA EDIFICAÇÃO TÉRREA OU SOBRADO UTILIZANDO AÇO CA-60 DE 5,0 MM - MONTAGEM. AF_12/2015"},{"$f":"IF(OFFSET(PO!O$12,ROW(D57)-ROW(D$12),0)=0,\"\",OFFSET(PO!O$12,ROW(D57)-ROW(D$12),0))","v":"KG"},{"$f":"IF($A57<>\"Serviço\",0,ROUND(SUMIF($F$9:$P$9,\"<>\",$F57:$P57),15-13*PO!$X$3))","v":101.52},{"$f":"OFFSET(PO!$P$12,ROW($E57)-ROW(F$12),0)","v":101.52}]
[{"$f":"OFFSET(PO!J$12,ROW(A58)-ROW($A$12),0)","v":"Serviço"},{"$f":"IF($A58=0,\"\",OFFSET(PO!K$12,ROW(B58)-ROW(B$12),0))","v":"4.2.4."},{"$f":"IF(OFFSET(PO!N$12,ROW(C58)-ROW(C$12),0)=0,\"\",OFFSET(PO!N$12,ROW(C58)-ROW(C$12),0))","v":"ARMAÇÃO DE PILAR OU VIGA DE UMA ESTRUTURA CONVENCIONAL DE CONCRETO ARMADO EM UMA EDIFICAÇÃO TÉRREA OU SOBRADO UTILIZANDO AÇO CA-50 DE 6,3 MM - MONTAGEM. AF_12/2015"},{"$f":"IF(OFFSET(PO!O$12,ROW(D58)-ROW(D$12),0)=0,\"\",OFFSET(PO!O$12,ROW(D58)-ROW(D$12),0))","v":"KG"},{"$f":"IF($A58<>\"Serviço\",0,ROUND(SUMIF($F$9:$P$9,\"<>\",$F58:$P58),15-13*PO!$X$3))","v":12.24},{"$f":"OFFSET(PO!$P$12,ROW($E58)-ROW(F$12),0)","v":12.24}]
[{"$f":"OFFSET(PO!J$12,ROW(A59)-ROW($A$12),0)","v":"Serviço"},{"$f":"IF($A59=0,\"\",OFFSET(PO!K$12,ROW(B59)-ROW(B$12),0))","v":"4.2.5."},{"$f":"IF(OFFSET(PO!N$12,ROW(C59)-ROW(C$12),0)=0,\"\",OFFSET(PO!N$12,ROW(C59)-ROW(C$12),0))","v":"ARMAÇÃO DE PILAR OU VIGA DE UMA ESTRUTURA CONVENCIONAL DE CONCRETO ARMADO EM UMA EDIFICAÇÃO TÉRREA OU SOBRADO UTILIZANDO AÇO CA-50 DE 8,0 MM - MONTAGEM. AF_12/2015"},{"$f":"IF(OFFSET(PO!O$12,ROW(D59)-ROW(D$12),0)=0,\"\",OFFSET(PO!O$12,ROW(D59)-ROW(D$12),0))","v":"KG"},{"$f":"IF($A59<>\"Serviço\",0,ROUND(SUMIF($F$9:$P$9,\"<>\",$F59:$P59),15-13*PO!$X$3))","v":91.35},{"$f":"OFFSET(PO!$P$12,ROW($E59)-ROW(F$12),0)","v":91.35}]
[{"$f":"OFFSET(PO!J$12,ROW(A60)-ROW($A$12),0)","v":"Serviço"},{"$f":"IF($A60=0,\"\",OFFSET(PO!K$12,ROW(B60)-ROW(B$12),0))","v":"4.2.6."},{"$f":"IF(OFFSET(PO!N$12,ROW(C60)-ROW(C$12),0)=0,\"\",OFFSET(PO!N$12,ROW(C60)-ROW(C$12),0))","v":"ARMAÇÃO DE PILAR OU VIGA DE UMA ESTRUTURA CONVENCIONAL DE CONCRETO ARMADO EM UMA EDIFICAÇÃO TÉRREA OU SOBRADO UTILIZANDO AÇO CA-50 DE 10,0 MM - MONTAGEM. AF_12/2015"},{"$f":"IF(OFFSET(PO!O$12,ROW(D60)-ROW(D$12),0)=0,\"\",OFFSET(PO!O$12,ROW(D60)-ROW(D$12),0))","v":"KG"},{"$f":"IF($A60<>\"Serviço\",0,ROUND(SUMIF($F$9:$P$9,\"<>\",$F60:$P60),15-13*PO!$X$3))","v":239.04},{"$f":"OFFSET(PO!$P$12,ROW($E60)-ROW(F$12),0)","v":239.04}]
[{"$f":"OFFSET(PO!J$12,ROW(A61)-ROW($A$12),0)","v":"Serviço"},{"$f":"IF($A61=0,\"\",OFFSET(PO!K$12,ROW(B61)-ROW(B$12),0))","v":"4.2.7."},{"$f":"IF(OFFSET(PO!N$12,ROW(C61)-ROW(C$12),0)=0,\"\",OFFSET(PO!N$12,ROW(C61)-ROW(C$12),0))","v":"ARMAÇÃO DE PILAR OU VIGA DE UMA ESTRUTURA CONVENCIONAL DE CONCRETO ARMADO EM UMA EDIFICAÇÃO TÉRREA OU SOBRADO UTILIZANDO AÇO CA-50 DE 12,5 MM - MONTAGEM. AF_12/2015"},{"$f":"IF(OFFSET(PO!O$12,ROW(D61)-ROW(D$12),0)=0,\"\",OFFSET(PO!O$12,ROW(D61)-ROW(D$12),0))","v":"KG"},{"$f":"IF($A61<>\"Serviço\",0,ROUND(SUMIF($F$9:$P$9,\"<>\",$F61:$P61),15-13*PO!$X$3))","v":25.2},{"$f":"OFFSET(PO!$P$12,ROW($E61)-ROW(F$12),0)","v":25.2}]
[{"$f":"OFFSET(PO!J$12,ROW(A62)-ROW($A$12),0)","v":"Nível 2"},{"$f":"IF($A62=0,\"\",OFFSET(PO!K$12,ROW(B62)-ROW(B$12),0))","v":"4.3."},{"$f":"IF(OFFSET(PO!N$12,ROW(C62)-ROW(C$12),0)=0,\"\",OFFSET(PO!N$12,ROW(C62)-ROW(C$12),0))","v":"LAJES - TÉRREO"},{"$f":"IF(OFFSET(PO!O$12,ROW(D62)-ROW(D$12),0)=0,\"\",OFFSET(PO!O$12,ROW(D62)-ROW(D$12),0))","v":""},{"$f":"IF($A62<>\"Serviço\",0,ROUND(SUMIF($F$9:$P$9,\"<>\",$F62:$P62),15-13*PO!$X$3))","v":0},{"$f":"OFFSET(PO!$P$12,ROW($E62)-ROW(F$12),0)","v":0}]
[{"$f":"OFFSET(PO!J$12,ROW(A63)-ROW($A$12),0)","v":"Serviço"},{"$f":"IF($A63=0,\"\",OFFSET(PO!K$12,ROW(B63)-ROW(B$12),0))","v":"4.3.1."},{"$f":"IF(OFFSET(PO!N$12,ROW(C63)-ROW(C$12),0)=0,\"\",OFFSET(PO!N$12,ROW(C63)-ROW(C$12),0))","v":"LAJE PRE-MOLDADA P/FORRO, SOBRECARGA 200 KG/M2, VAOS ATE 4,50M/ALTURA TOTAL=12CM, C/LAJOTAS E CAP.C/CONC. USINADO FCK=25MPA, 4CM,C/ESCORAMENTO (REAPR.3X) E FERRAGEM NEGATIVA, INCLUSO PROJETO E ART"},{"$f":"IF(OFFSET(PO!O$12,ROW(D63)-ROW(D$12),0)=0,\"\",OFFSET(PO!O$12,ROW(D63)-ROW(D$12),0))","v":"M2"},{"$f":"IF($A63<>\"Serviço\",0,ROUND(SUMIF($F$9:$P$9,\"<>\",$F63:$P63),15-13*PO!$X$3))","v":165.3},{"$f":"OFFSET(PO!$P$12,ROW($E63)-ROW(F$12),0)","v":165.3}]
[{"$f":"OFFSET(PO!J$12,ROW(A64)-ROW($A$12),0)","v":"Nível 2"},{"$f":"IF($A64=0,\"\",OFFSET(PO!K$12,ROW(B64)-ROW(B$12),0))","v":"4.4."},{"$f":"IF(OFFSET(PO!N$12,ROW(C64)-ROW(C$12),0)=0,\"\",OFFSET(PO!N$12,ROW(C64)-ROW(C$12),0))","v":"PILARES - PLATIBANDA/CAIXA D'ÁGUA"},{"$f":"IF(OFFSET(PO!O$12,ROW(D64)-ROW(D$12),0)=0,\"\",OFFSET(PO!O$12,ROW(D64)-ROW(D$12),0))","v":""},{"$f":"IF($A64<>\"Serviço\",0,ROUND(SUMIF($F$9:$P$9,\"<>\",$F64:$P64),15-13*PO!$X$3))","v":0},{"$f":"OFFSET(PO!$P$12,ROW($E64)-ROW(F$12),0)","v":0}]
[{"$f":"OFFSET(PO!J$12,ROW(A65)-ROW($A$12),0)","v":"Serviço"},{"$f":"IF($A65=0,\"\",OFFSET(PO!K$12,ROW(B65)-ROW(B$12),0))","v":"4.4.1."},{"$f":"IF(OFFSET(PO!N$12,ROW(C65)-ROW(C$12),0)=0,\"\",OFFSET(PO!N$12,ROW(C65)-ROW(C$12),0))","v":"MONTAGEM E DESMONTAGEM DE FÔRMA DE PILARES RETANGULARES E ESTRUTURAS SIMILARES COM ÁREA MÉDIA DAS SEÇÕES MENOR OU IGUAL A 0,25 M², PÉ-DIREITO SIMPLES, EM CHAPA DE MADEIRA COMPENSADA PLASTIFICADA, 12 UTILIZAÇÕES. AF_12/2015"},{"$f":"IF(OFFSET(PO!O$12,ROW(D65)-ROW(D$12),0)=0,\"\",OFFSET(PO!O$12,ROW(D65)-ROW(D$12),0))","v":"M2"},{"$f":"IF($A65<>\"Serviço\",0,ROUND(SUMIF($F$9:$P$9,\"<>\",$F65:$P65),15-13*PO!$X$3))","v":13.83},{"$f":"OFFSET(PO!$P$12,ROW($E65)-ROW(F$12),0)","v":13.83}]
[{"$f":"OFFSET(PO!J$12,ROW(A66)-ROW($A$12),0)","v":"Serviço"},{"$f":"IF($A66=0,\"\",OFFSET(PO!K$12,ROW(B66)-ROW(B$12),0))","v":"4.4.2."},{"$f":"IF(OFFSET(PO!N$12,ROW(C66)-ROW(C$12),0)=0,\"\",OFFSET(PO!N$12,ROW(C66)-ROW(C$12),0))","v":"CONCRETAGEM DE PILARES, FCK = 25 MPA, COM USO DE BOMBA EM EDIFICAÇÃO COM SEÇÃO MÉDIA DE PILARES MENOR OU IGUAL A 0,25 M² - LANÇAMENTO, ADENSAMENTO E ACABAMENTO. AF_12/2015"},{"$f":"IF(OFFSET(PO!O$12,ROW(D66)-ROW(D$12),0)=0,\"\",OFFSET(PO!O$12,ROW(D66)-ROW(D$12),0))","v":"M3"},{"$f":"IF($A66<>\"Serviço\",0,ROUND(SUMIF($F$9:$P$9,\"<>\",$F66:$P66),15-13*PO!$X$3))","v":0.87},{"$f":"OFFSET(PO!$P$12,ROW($E66)-ROW(F$12),0)","v":0.87}]
[{"$f":"OFFSET(PO!J$12,ROW(A67)-ROW($A$12),0)","v":"Serviço"},{"$f":"IF($A67=0,\"\",OFFSET(PO!K$12,ROW(B67)-ROW(B$12),0))","v":"4.4.3."},{"$f":"IF(OFFSET(PO!N$12,ROW(C67)-ROW(C$12),0)=0,\"\",OFFSET(PO!N$12,ROW(C67)-ROW(C$12),0))","v":"ARMAÇÃO DE PILAR OU VIGA DE UMA ESTRUTURA CONVENCIONAL DE CONCRETO ARMADO EM UMA EDIFICAÇÃO TÉRREA OU SOBRADO UTILIZANDO AÇO CA-60 DE 5,0 MM - MONTAGEM. AF_12/2015"},{"$f":"IF(OFFSET(PO!O$12,ROW(D67)-ROW(D$12),0)=0,\"\",OFFSET(PO!O$12,ROW(D67)-ROW(D$12),0))","v":"KG"},{"$f":"IF($A67<>\"Serviço\",0,ROUND(SUMIF($F$9:$P$9,\"<>\",$F67:$P67),15-13*PO!$X$3))","v":27.18},{"$f":"OFFSET(PO!$P$12,ROW($E67)-ROW(F$12),0)","v":27.18}]
[{"$f":"OFFSET(PO!J$12,ROW(A68)-ROW($A$12),0)","v":"Serviço"},{"$f":"IF($A68=0,\"\",OFFSET(PO!K$12,ROW(B68)-ROW(B$12),0))","v":"4.4.4."},{"$f":"IF(OFFSET(PO!N$12,ROW(C68)-ROW(C$12),0)=0,\"\",OFFSET(PO!N$12,ROW(C68)-ROW(C$12),0))","v":"ARMAÇÃO DE PILAR OU VIGA DE UMA ESTRUTURA CONVENCIONAL DE CONCRETO ARMADO EM UMA EDIFICAÇÃO TÉRREA OU SOBRADO UTILIZANDO AÇO CA-50 DE 10,0 MM - MONTAGEM. AF_12/2015"},{"$f":"IF(OFFSET(PO!O$12,ROW(D68)-ROW(D$12),0)=0,\"\",OFFSET(PO!O$12,ROW(D68)-ROW(D$12),0))","v":"KG"},{"$f":"IF($A68<>\"Serviço\",0,ROUND(SUMIF($F$9:$P$9,\"<>\",$F68:$P68),15-13*PO!$X$3))","v":86.58},{"$f":"OFFSET(PO!$P$12,ROW($E68)-ROW(F$12),0)","v":86.58}]
[{"$f":"OFFSET(PO!J$12,ROW(A69)-ROW($A$12),0)","v":"Serviço"},{"$f":"IF($A69=0,\"\",OFFSET(PO!K$12,ROW(B69)-ROW(B$12),0))","v":"4.4.5."},{"$f":"IF(OFFSET(PO!N$12,ROW(C69)-ROW(C$12),0)=0,\"\",OFFSET(PO!N$12,ROW(C69)-ROW(C$12),0))","v":"ARMAÇÃO DE PILAR OU VIGA DE UMA ESTRUTURA CONVENCIONAL DE CONCRETO ARMADO EM UMA EDIFICAÇÃO TÉRREA OU SOBRADO UTILIZANDO AÇO CA-50 DE 12,5 MM - MONTAGEM. AF_12/2015"},{"$f":"IF(OFFSET(PO!O$12,ROW(D69)-ROW(D$12),0)=0,\"\",OFFSET(PO!O$12,ROW(D69)-ROW(D$12),0))","v":"KG"},{"$f":"IF($A69<>\"Serviço\",0,ROUND(SUMIF($F$9:$P$9,\"<>\",$F69:$P69),15-13*PO!$X$3))","v":8.01},{"$f":"OFFSET(PO!$P$12,ROW($E69)-ROW(F$12),0)","v":8.01}]
[{"$f":"OFFSET(PO!J$12,ROW(A70)-ROW($A$12),0)","v":"Nível 2"},{"$f":"IF($A70=0,\"\",OFFSET(PO!K$12,ROW(B70)-ROW(B$12),0))","v":"4.5."},{"$f":"IF(OFFSET(PO!N$12,ROW(C70)-ROW(C$12),0)=0,\"\",OFFSET(PO!N$12,ROW(C70)-ROW(C$12),0))","v":"VIGAS - PLATIBANDA/CAIXA D'ÁGUA"},{"$f":"IF(OFFSET(PO!O$12,ROW(D70)-ROW(D$12),0)=0,\"\",OFFSET(PO!O$12,ROW(D70)-ROW(D$12),0))","v":""},{"$f":"IF($A70<>\"Serviço\",0,ROUND(SUMIF($F$9:$P$9,\"<>\",$F70:$P70),15-13*PO!$X$3))","v":0},{"$f":"OFFSET(PO!$P$12,ROW($E70)-ROW(F$12),0)","v":0}]
[{"$f":"OFFSET(PO!J$12,ROW(A71)-ROW($A$12),0)","v":"Serviço"},{"$f":"IF($A71=0,\"\",OFFSET(PO!K$12,ROW(B71)-ROW(B$12),0))","v":"4.5.1."},{"$f":"IF(OFFSET(PO!N$12,ROW(C71)-ROW(C$12),0)=0,\"\",OFFSET(PO!N$12,ROW(C71)-ROW(C$12),0))","v":"MONTAGEM E DESMONTAGEM DE FÔRMA DE VIGA, ESCORAMENTO COM GARFO DE MADEIRA, PÉ-DIREITO SIMPLES, EM CHAPA DE MADEIRA PLASTIFICADA, 18 UTILIZAÇÕES. AF_12/2015"},{"$f":"IF(OFFSET(PO!O$12,ROW(D71)-ROW(D$12),0)=0,\"\",OFFSET(PO!O$12,ROW(D71)-ROW(D$12),0))","v":"M2"},{"$f":"IF($A71<>\"Serviço\",0,ROUND(SUMIF($F$9:$P$9,\"<>\",$F71:$P71),15-13*PO!$X$3))","v":26.52},{"$f":"OFFSET(PO!$P$12,ROW($E71)-ROW(F$12),0)","v":26.52}]
[{"$f":"OFFSET(PO!J$12,ROW(A72)-ROW($A$12),0)","v":"Serviço"},{"$f":"IF($A72=0,\"\",OFFSET(PO!K$12,ROW(B72)-ROW(B$12),0))","v":"4.5.2."},{"$f":"IF(OFFSET(PO!N$12,ROW(C72)-ROW(C$12),0)=0,\"\",OFFSET(PO!N$12,ROW(C72)-ROW(C$12),0))","v":"CONCRETAGEM DE VIGAS E LAJES, FCK=25 MPA - LANÇAMENTO, ADENSAMENTO E ACABAMENTO"},{"$f":"IF(OFFSET(PO!O$12,ROW(D72)-ROW(D$12),0)=0,\"\",OFFSET(PO!O$12,ROW(D72)-ROW(D$12),0))","v":"M3"},{"$f":"IF($A72<>\"Serviço\",0,ROUND(SUMIF($F$9:$P$9,\"<>\",$F72:$P72),15-13*PO!$X$3))","v":1.74},{"$f":"OFFSET(PO!$P$12,ROW($E72)-ROW(F$12),0)","v":1.74}]
[{"$f":"OFFSET(PO!J$12,ROW(A73)-ROW($A$12),0)","v":"Serviço"},{"$f":"IF($A73=0,\"\",OFFSET(PO!K$12,ROW(B73)-ROW(B$12),0))","v":"4.5.3."},{"$f":"IF(OFFSET(PO!N$12,ROW(C73)-ROW(C$12),0)=0,\"\",OFFSET(PO!N$12,ROW(C73)-ROW(C$12),0))","v":"ARMAÇÃO DE PILAR OU VIGA DE UMA ESTRUTURA CONVENCIONAL DE CONCRETO ARMADO EM UMA EDIFICAÇÃO TÉRREA OU SOBRADO UTILIZANDO AÇO CA-60 DE 5,0 MM - MONTAGEM. AF_12/2015"},{"$f":"IF(OFFSET(PO!O$12,ROW(D73)-ROW(D$12),0)=0,\"\",OFFSET(PO!O$12,ROW(D73)-ROW(D$12),0))","v":"KG"},{"$f":"IF($A73<>\"Serviço\",0,ROUND(SUMIF($F$9:$P$9,\"<>\",$F73:$P73),15-13*PO!$X$3))","v":80.37},{"$f":"OFFSET(PO!$P$12,ROW($E73)-ROW(F$12),0)","v":80.37}]
[{"$f":"OFFSET(PO!J$12,ROW(A74)-ROW($A$12),0)","v":"Serviço"},{"$f":"IF($A74=0,\"\",OFFSET(PO!K$12,ROW(B74)-ROW(B$12),0))","v":"4.5.4."},{"$f":"IF(OFFSET(PO!N$12,ROW(C74)-ROW(C$12),0)=0,\"\",OFFSET(PO!N$12,ROW(C74)-ROW(C$12),0))","v":"ARMAÇÃO DE PILAR OU VIGA DE UMA ESTRUTURA CONVENCIONAL DE CONCRETO ARMADO EM UMA EDIFICAÇÃO TÉRREA OU SOBRADO UTILIZANDO AÇO CA-50 DE 8,0 MM - MONTAGEM. AF_12/2015"},{"$f":"IF(OFFSET(PO!O$12,ROW(D74)-ROW(D$12),0)=0,\"\",OFFSET(PO!O$12,ROW(D74)-ROW(D$12),0))","v":"KG"},{"$f":"IF($A74<>\"Serviço\",0,ROUND(SUMIF($F$9:$P$9,\"<>\",$F74:$P74),15-13*PO!$X$3))","v":94.41},{"$f":"OFFSET(PO!$P$12,ROW($E74)-ROW(F$12),0)","v":94.41}]
[{"$f":"OFFSET(PO!J$12,ROW(A75)-ROW($A$12),0)","v":"Serviço"},{"$f":"IF($A75=0,\"\",OFFSET(PO!K$12,ROW(B75)-ROW(B$12),0))","v":"4.5.5."},{"$f":"IF(OFFSET(PO!N$12,ROW(C75)-ROW(C$12),0)=0,\"\",OFFSET(PO!N$12,ROW(C75)-ROW(C$12),0))","v":"ARMAÇÃO DE PILAR OU VIGA DE UMA ESTRUTURA CONVENCIONAL DE CONCRETO ARMADO EM UMA EDIFICAÇÃO TÉRREA OU SOBRADO UTILIZANDO AÇO CA-50 DE 10,0 MM - MONTAGEM. AF_12/2015"},{"$f":"IF(OFFSET(PO!O$12,ROW(D75)-ROW(D$12),0)=0,\"\",OFFSET(PO!O$12,ROW(D75)-ROW(D$12),0))","v":"KG"},{"$f":"IF($A75<>\"Serviço\",0,ROUND(SUMIF($F$9:$P$9,\"<>\",$F75:$P75),15-13*PO!$X$3))","v":30.51},{"$f":"OFFSET(PO!$P$12,ROW($E75)-ROW(F$12),0)","v":30.51}]
[{"$f":"OFFSET(PO!J$12,ROW(A76)-ROW($A$12),0)","v":"Nível 2"},{"$f":"IF($A76=0,\"\",OFFSET(PO!K$12,ROW(B76)-ROW(B$12),0))","v":"4.6."},{"$f":"IF(OFFSET(PO!N$12,ROW(C76)-ROW(C$12),0)=0,\"\",OFFSET(PO!N$12,ROW(C76)-ROW(C$12),0))","v":"LAJE - CAIXA D'ÁGUA"},{"$f":"IF(OFFSET(PO!O$12,ROW(D76)-ROW(D$12),0)=0,\"\",OFFSET(PO!O$12,ROW(D76)-ROW(D$12),0))","v":""},{"$f":"IF($A76<>\"Serviço\",0,ROUND(SUMIF($F$9:$P$9,\"<>\",$F76:$P76),15-13*PO!$X$3))","v":0},{"$f":"OFFSET(PO!$P$12,ROW($E76)-ROW(F$12),0)","v":0}]
[{"$f":"OFFSET(PO!J$12,ROW(A77)-ROW($A$12),0)","v":"Serviço"},{"$f":"IF($A77=0,\"\",OFFSET(PO!K$12,ROW(B77)-ROW(B$12),0))","v":"4.6.1."},{"$f":"IF(OFFSET(PO!N$12,ROW(C77)-ROW(C$12),0)=0,\"\",OFFSET(PO!N$12,ROW(C77)-ROW(C$12),0))","v":"LAJE PRE-MOLDADA P/PISO, SOBRECARGA 750 KG/M2, VAOS ATE 3,50M/ ALTURA TOTAL=12CM, C/LAJOTAS E CAP.C/CONC. USINADO FCK=25MPA, 4CM E FERRAGEM NEGATIVA, INCLUSO PROJETO E ART"},{"$f":"IF(OFFSET(PO!O$12,ROW(D77)-ROW(D$12),0)=0,\"\",OFFSET(PO!O$12,ROW(D77)-ROW(D$12),0))","v":"M2"},{"$f":"IF($A77<>\"Serviço\",0,ROUND(SUMIF($F$9:$P$9,\"<>\",$F77:$P77),15-13*PO!$X$3))","v":10.32},{"$f":"OFFSET(PO!$P$12,ROW($E77)-ROW(F$12),0)","v":10.32}]
[{"$f":"OFFSET(PO!J$12,ROW(A78)-ROW($A$12),0)","v":"Nível 2"},{"$f":"IF($A78=0,\"\",OFFSET(PO!K$12,ROW(B78)-ROW(B$12),0))","v":"4.7."},{"$f":"IF(OFFSET(PO!N$12,ROW(C78)-ROW(C$12),0)=0,\"\",OFFSET(PO!N$12,ROW(C78)-ROW(C$12),0))","v":"PILARES - COBERTURA"},{"$f":"IF(OFFSET(PO!O$12,ROW(D78)-ROW(D$12),0)=0,\"\",OFFSET(PO!O$12,ROW(D78)-ROW(D$12),0))","v":""},{"$f":"IF($A78<>\"Serviço\",0,ROUND(SUMIF($F$9:$P$9,\"<>\",$F78:$P78),15-13*PO!$X$3))","v":0},{"$f":"OFFSET(PO!$P$12,ROW($E78)-ROW(F$12),0)","v":0}]
[{"$f":"OFFSET(PO!J$12,ROW(A79)-ROW($A$12),0)","v":"Serviço"},{"$f":"IF($A79=0,\"\",OFFSET(PO!K$12,ROW(B79)-ROW(B$12),0))","v":"4.7.1."},{"$f":"IF(OFFSET(PO!N$12,ROW(C79)-ROW(C$12),0)=0,\"\",OFFSET(PO!N$12,ROW(C79)-ROW(C$12),0))","v":"MONTAGEM E DESMONTAGEM DE FÔRMA DE PILARES RETANGULARES E ESTRUTURAS SIMILARES COM ÁREA MÉDIA DAS SEÇÕES MENOR OU IGUAL A 0,25 M², PÉ-DIREITO SIMPLES, EM CHAPA DE MADEIRA COMPENSADA PLASTIFICADA, 12 UTILIZAÇÕES. AF_12/2015"},{"$f":"IF(OFFSET(PO!O$12,ROW(D79)-ROW(D$12),0)=0,\"\",OFFSET(PO!O$12,ROW(D79)-ROW(D$12),0))","v":"M2"},{"$f":"IF($A79<>\"Serviço\",0,ROUND(SUMIF($F$9:$P$9,\"<>\",$F79:$P79),15-13*PO!$X$3))","v":3.9},{"$f":"OFFSET(PO!$P$12,ROW($E79)-ROW(F$12),0)","v":3.9}]
[{"$f":"OFFSET(PO!J$12,ROW(A80)-ROW($A$12),0)","v":"Serviço"},{"$f":"IF($A80=0,\"\",OFFSET(PO!K$12,ROW(B80)-ROW(B$12),0))","v":"4.7.2."},{"$f":"IF(OFFSET(PO!N$12,ROW(C80)-ROW(C$12),0)=0,\"\",OFFSET(PO!N$12,ROW(C80)-ROW(C$12),0))","v":"CONCRETAGEM DE PILARES, FCK = 25 MPA, COM USO DE BOMBA EM EDIFICAÇÃO COM SEÇÃO MÉDIA DE PILARES MENOR OU IGUAL A 0,25 M² - LANÇAMENTO, ADENSAMENTO E ACABAMENTO. AF_12/2015"},{"$f":"IF(OFFSET(PO!O$12,ROW(D80)-ROW(D$12),0)=0,\"\",OFFSET(PO!O$12,ROW(D80)-ROW(D$12),0))","v":"M3"},{"$f":"IF($A80<>\"Serviço\",0,ROUND(SUMIF($F$9:$P$9,\"<>\",$F80:$P80),15-13*PO!$X$3))","v":0.25},{"$f":"OFFSET(PO!$P$12,ROW($E80)-ROW(F$12),0)","v":0.25}]
[{"$f":"OFFSET(PO!J$12,ROW(A81)-ROW($A$12),0)","v":"Serviço"},{"$f":"IF($A81=0,\"\",OFFSET(PO!K$12,ROW(B81)-ROW(B$12),0))","v":"4.7.3."},{"$f":"IF(OFFSET(PO!N$12,ROW(C81)-ROW(C$12),0)=0,\"\",OFFSET(PO!N$12,ROW(C81)-ROW(C$12),0))","v":"ARMAÇÃO DE PILAR OU VIGA DE UMA ESTRUTURA CONVENCIONAL DE CONCRETO ARMADO EM UMA EDIFICAÇÃO TÉRREA OU SOBRADO UTILIZANDO AÇO CA-60 DE 5,0 MM - MONTAGEM. AF_12/2015"},{"$f":"IF(OFFSET(PO!O$12,ROW(D81)-ROW(D$12),0)=0,\"\",OFFSET(PO!O$12,ROW(D81)-ROW(D$12),0))","v":"KG"},{"$f":"IF($A81<>\"Serviço\",0,ROUND(SUMIF($F$9:$P$9,\"<>\",$F81:$P81),15-13*PO!$X$3))","v":6.93},{"$f":"OFFSET(PO!$P$12,ROW($E81)-ROW(F$12),0)","v":6.93}]
[{"$f":"OFFSET(PO!J$12,ROW(A82)-ROW($A$12),0)","v":"Serviço"},{"$f":"IF($A82=0,\"\",OFFSET(PO!K$12,ROW(B82)-ROW(B$12),0))","v":"4.7.4."},{"$f":"IF(OFFSET(PO!N$12,ROW(C82)-ROW(C$12),0)=0,\"\",OFFSET(PO!N$12,ROW(C82)-ROW(C$12),0))","v":"ARMAÇÃO DE PILAR OU VIGA DE UMA ESTRUTURA CONVENCIONAL DE CONCRETO ARMADO EM UMA EDIFICAÇÃO TÉRREA OU SOBRADO UTILIZANDO AÇO CA-50 DE 10,0 MM - MONTAGEM. AF_12/2015"},{"$f":"IF(OFFSET(PO!O$12,ROW(D82)-ROW(D$12),0)=0,\"\",OFFSET(PO!O$12,ROW(D82)-ROW(D$12),0))","v":"KG"},{"$f":"IF($A82<>\"Serviço\",0,ROUND(SUMIF($F$9:$P$9,\"<>\",$F82:$P82),15-13*PO!$X$3))","v":16.29},{"$f":"OFFSET(PO!$P$12,ROW($E82)-ROW(F$12),0)","v":16.29}]
[{"$f":"OFFSET(PO!J$12,ROW(A83)-ROW($A$12),0)","v":"Nível 2"},{"$f":"IF($A83=0,\"\",OFFSET(PO!K$12,ROW(B83)-ROW(B$12),0))","v":"4.8."},{"$f":"IF(OFFSET(PO!N$12,ROW(C83)-ROW(C$12),0)=0,\"\",OFFSET(PO!N$12,ROW(C83)-ROW(C$12),0))","v":"VIGAS - COBERTURA"},{"$f":"IF(OFFSET(PO!O$12,ROW(D83)-ROW(D$12),0)=0,\"\",OFFSET(PO!O$12,ROW(D83)-ROW(D$12),0))","v":""},{"$f":"IF($A83<>\"Serviço\",0,ROUND(SUMIF($F$9:$P$9,\"<>\",$F83:$P83),15-13*PO!$X$3))","v":0},{"$f":"OFFSET(PO!$P$12,ROW($E83)-ROW(F$12),0)","v":0}]
[{"$f":"OFFSET(PO!J$12,ROW(A84)-ROW($A$12),0)","v":"Serviço"},{"$f":"IF($A84=0,\"\",OFFSET(PO!K$12,ROW(B84)-ROW(B$12),0))","v":"4.8.1."},{"$f":"IF(OFFSET(PO!N$12,ROW(C84)-ROW(C$12),0)=0,\"\",OFFSET(PO!N$12,ROW(C84)-ROW(C$12),0))","v":"MONTAGEM E DESMONTAGEM DE FÔRMA DE VIGA, ESCORAMENTO COM GARFO DE MADEIRA, PÉ-DIREITO SIMPLES, EM CHAPA DE MADEIRA PLASTIFICADA, 18 UTILIZAÇÕES. AF_12/2015"},{"$f":"IF(OFFSET(PO!O$12,ROW(D84)-ROW(D$12),0)=0,\"\",OFFSET(PO!O$12,ROW(D84)-ROW(D$12),0))","v":"M2"},{"$f":"IF($A84<>\"Serviço\",0,ROUND(SUMIF($F$9:$P$9,\"<>\",$F84:$P84),15-13*PO!$X$3))","v":5.23},{"$f":"OFFSET(PO!$P$12,ROW($E84)-ROW(F$12),0)","v":5.23}]
[{"$f":"OFFSET(PO!J$12,ROW(A85)-ROW($A$12),0)","v":"Serviço"},{"$f":"IF($A85=0,\"\",OFFSET(PO!K$12,ROW(B85)-ROW(B$12),0))","v":"4.8.2."},{"$f":"IF(OFFSET(PO!N$12,ROW(C85)-ROW(C$12),0)=0,\"\",OFFSET(PO!N$12,ROW(C85)-ROW(C$12),0))","v":"CONCRETAGEM DE VIGAS E LAJES, FCK=20 MPA, PARA LAJES MACIÇAS OU NERVURADAS COM USO DE BOMBA EM EDIFICAÇÃO COM ÁREA MÉDIA DE LAJES MAIOR QUE 20 M² - LANÇAMENTO, ADENSAMENTO E ACABAMENTO. AF_12/2015"},{"$f":"IF(OFFSET(PO!O$12,ROW(D85)-ROW(D$12),0)=0,\"\",OFFSET(PO!O$12,ROW(D85)-ROW(D$12),0))","v":"M3"},{"$f":"IF($A85<>\"Serviço\",0,ROUND(SUMIF($F$9:$P$9,\"<>\",$F85:$P85),15-13*PO!$X$3))","v":0.34},{"$f":"OFFSET(PO!$P$12,ROW($E85)-ROW(F$12),0)","v":0.34}]
[{"$f":"OFFSET(PO!J$12,ROW(A86)-ROW($A$12),0)","v":"Serviço"},{"$f":"IF($A86=0,\"\",OFFSET(PO!K$12,ROW(B86)-ROW(B$12),0))","v":"4.8.3."},{"$f":"IF(OFFSET(PO!N$12,ROW(C86)-ROW(C$12),0)=0,\"\",OFFSET(PO!N$12,ROW(C86)-ROW(C$12),0))","v":"ARMAÇÃO DE PILAR OU VIGA DE UMA ESTRUTURA CONVENCIONAL DE CONCRETO ARMADO EM UMA EDIFICAÇÃO TÉRREA OU SOBRADO UTILIZANDO AÇO CA-60 DE 5,0 MM - MONTAGEM. AF_12/2015"},{"$f":"IF(OFFSET(PO!O$12,ROW(D86)-ROW(D$12),0)=0,\"\",OFFSET(PO!O$12,ROW(D86)-ROW(D$12),0))","v":"KG"},{"$f":"IF($A86<>\"Serviço\",0,ROUND(SUMIF($F$9:$P$9,\"<>\",$F86:$P86),15-13*PO!$X$3))","v":12.69},{"$f":"OFFSET(PO!$P$12,ROW($E86)-ROW(F$12),0)","v":12.69}]
[{"$f":"OFFSET(PO!J$12,ROW(A87)-ROW($A$12),0)","v":"Serviço"},{"$f":"IF($A87=0,\"\",OFFSET(PO!K$12,ROW(B87)-ROW(B$12),0))","v":"4.8.4."},{"$f":"IF(OFFSET(PO!N$12,ROW(C87)-ROW(C$12),0)=0,\"\",OFFSET(PO!N$12,ROW(C87)-ROW(C$12),0))","v":"ARMAÇÃO DE PILAR OU VIGA DE UMA ESTRUTURA CONVENCIONAL DE CONCRETO ARMADO EM UMA EDIFICAÇÃO TÉRREA OU SOBRADO UTILIZANDO AÇO CA-50 DE 8,0 MM - MONTAGEM. AF_12/2015"},{"$f":"IF(OFFSET(PO!O$12,ROW(D87)-ROW(D$12),0)=0,\"\",OFFSET(PO!O$12,ROW(D87)-ROW(D$12),0))","v":"KG"},{"$f":"IF($A87<>\"Serviço\",0,ROUND(SUMIF($F$9:$P$9,\"<>\",$F87:$P87),15-13*PO!$X$3))","v":20.52},{"$f":"OFFSET(PO!$P$12,ROW($E87)-ROW(F$12),0)","v":20.52}]
[{"$f":"OFFSET(PO!J$12,ROW(A88)-ROW($A$12),0)","v":"Nível 2"},{"$f":"IF($A88=0,\"\",OFFSET(PO!K$12,ROW(B88)-ROW(B$12),0))","v":"4.9."},{"$f":"IF(OFFSET(PO!N$12,ROW(C88)-ROW(C$12),0)=0,\"\",OFFSET(PO!N$12,ROW(C88)-ROW(C$12),0))","v":"VERGAS/CONTRA-VERGAS"},{"$f":"IF(OFFSET(PO!O$12,ROW(D88)-ROW(D$12),0)=0,\"\",OFFSET(PO!O$12,ROW(D88)-ROW(D$12),0))","v":""},{"$f":"IF($A88<>\"Serviço\",0,ROUND(SUMIF($F$9:$P$9,\"<>\",$F88:$P88),15-13*PO!$X$3))","v":0},{"$f":"OFFSET(PO!$P$12,ROW($E88)-ROW(F$12),0)","v":0}]
[{"$f":"OFFSET(PO!J$12,ROW(A89)-ROW($A$12),0)","v":"Serviço"},{"$f":"IF($A89=0,\"\",OFFSET(PO!K$12,ROW(B89)-ROW(B$12),0))","v":"4.9.1."},{"$f":"IF(OFFSET(PO!N$12,ROW(C89)-ROW(C$12),0)=0,\"\",OFFSET(PO!N$12,ROW(C89)-ROW(C$12),0))","v":"VERGA PRÉ-MOLDADA PARA PORTAS COM ATÉ 1,5 M DE VÃO. AF_03/2016"},{"$f":"IF(OFFSET(PO!O$12,ROW(D89)-ROW(D$12),0)=0,\"\",OFFSET(PO!O$12,ROW(D89)-ROW(D$12),0))","v":"M"},{"$f":"IF($A89<>\"Serviço\",0,ROUND(SUMIF($F$9:$P$9,\"<>\",$F89:$P89),15-13*PO!$X$3))","v":16},{"$f":"OFFSET(PO!$P$12,ROW($E89)-ROW(F$12),0)","v":16}]
[{"$f":"OFFSET(PO!J$12,ROW(A90)-ROW($A$12),0)","v":"Serviço"},{"$f":"IF($A90=0,\"\",OFFSET(PO!K$12,ROW(B90)-ROW(B$12),0))","v":"4.9.2."},{"$f":"IF(OFFSET(PO!N$12,ROW(C90)-ROW(C$12),0)=0,\"\",OFFSET(PO!N$12,ROW(C90)-ROW(C$12),0))","v":"VERGA PRÉ-MOLDADA PARA PORTAS COM MAIS DE 1,5 M DE VÃO. AF_03/2016"},{"$f":"IF(OFFSET(PO!O$12,ROW(D90)-ROW(D$12),0)=0,\"\",OFFSET(PO!O$12,ROW(D90)-ROW(D$12),0))","v":"M"},{"$f":"IF($A90<>\"Serviço\",0,ROUND(SUMIF($F$9:$P$9,\"<>\",$F90:$P90),15-13*PO!$X$3))","v":5.3},{"$f":"OFFSET(PO!$P$12,ROW($E90)-ROW(F$12),0)","v":5.3}]
[{"$f":"OFFSET(PO!J$12,ROW(A91)-ROW($A$12),0)","v":"Serviço"},{"$f":"IF($A91=0,\"\",OFFSET(PO!K$12,ROW(B91)-ROW(B$12),0))","v":"4.9.3."},{"$f":"IF(OFFSET(PO!N$12,ROW(C91)-ROW(C$12),0)=0,\"\",OFFSET(PO!N$12,ROW(C91)-ROW(C$12),0))","v":"VERGA PRÉ-MOLDADA PARA JANELAS COM ATÉ 1,5 M DE VÃO. AF_03/2016"},{"$f":"IF(OFFSET(PO!O$12,ROW(D91)-ROW(D$12),0)=0,\"\",OFFSET(PO!O$12,ROW(D91)-ROW(D$12),0))","v":"M"},{"$f":"IF($A91<>\"Serviço\",0,ROUND(SUMIF($F$9:$P$9,\"<>\",$F91:$P91),15-13*PO!$X$3))","v":13},{"$f":"OFFSET(PO!$P$12,ROW($E91)-ROW(F$12),0)","v":13}]
[{"$f":"OFFSET(PO!J$12,ROW(A92)-ROW($A$12),0)","v":"Serviço"},{"$f":"IF($A92=0,\"\",OFFSET(PO!K$12,ROW(B92)-ROW(B$12),0))","v":"4.9.4."},{"$f":"IF(OFFSET(PO!N$12,ROW(C92)-ROW(C$12),0)=0,\"\",OFFSET(PO!N$12,ROW(C92)-ROW(C$12),0))","v":"VERGA PRÉ-MOLDADA PARA JANELAS COM MAIS DE 1,5 M DE VÃO. AF_03/2016"},{"$f":"IF(OFFSET(PO!O$12,ROW(D92)-ROW(D$12),0)=0,\"\",OFFSET(PO!O$12,ROW(D92)-ROW(D$12),0))","v":"M"},{"$f":"IF($A92<>\"Serviço\",0,ROUND(SUMIF($F$9:$P$9,\"<>\",$F92:$P92),15-13*PO!$X$3))","v":14.05},{"$f":"OFFSET(PO!$P$12,ROW($E92)-ROW(F$12),0)","v":14.05}]
[{"$f":"OFFSET(PO!J$12,ROW(A93)-ROW($A$12),0)","v":"Serviço"},{"$f":"IF($A93=0,\"\",OFFSET(PO!K$12,ROW(B93)-ROW(B$12),0))","v":"4.9.5."},{"$f":"IF(OFFSET(PO!N$12,ROW(C93)-ROW(C$12),0)=0,\"\",OFFSET(PO!N$12,ROW(C93)-ROW(C$12),0))","v":"CONTRAVERGA PRÉ-MOLDADA PARA VÃOS DE ATÉ 1,5 M DE COMPRIMENTO. AF_03/2016"},{"$f":"IF(OFFSET(PO!O$12,ROW(D93)-ROW(D$12),0)=0,\"\",OFFSET(PO!O$12,ROW(D93)-ROW(D$12),0))","v":"M"},{"$f":"IF($A93<>\"Serviço\",0,ROUND(SUMIF($F$9:$P$9,\"<>\",$F93:$P93),15-13*PO!$X$3))","v":13},{"$f":"OFFSET(PO!$P$12,ROW($E93)-ROW(F$12),0)","v":13}]
[{"$f":"OFFSET(PO!J$12,ROW(A94)-ROW($A$12),0)","v":"Serviço"},{"$f":"IF($A94=0,\"\",OFFSET(PO!K$12,ROW(B94)-ROW(B$12),0))","v":"4.9.6."},{"$f":"IF(OFFSET(PO!N$12,ROW(C94)-ROW(C$12),0)=0,\"\",OFFSET(PO!N$12,ROW(C94)-ROW(C$12),0))","v":"CONTRAVERGA PRÉ-MOLDADA PARA VÃOS DE MAIS DE 1,5 M DE COMPRIMENTO. AF_03/2016"},{"$f":"IF(OFFSET(PO!O$12,ROW(D94)-ROW(D$12),0)=0,\"\",OFFSET(PO!O$12,ROW(D94)-ROW(D$12),0))","v":"M"},{"$f":"IF($A94<>\"Serviço\",0,ROUND(SUMIF($F$9:$P$9,\"<>\",$F94:$P94),15-13*PO!$X$3))","v":14.05},{"$f":"OFFSET(PO!$P$12,ROW($E94)-ROW(F$12),0)","v":14.05}]
[{"$f":"OFFSET(PO!J$12,ROW(A95)-ROW($A$12),0)","v":"Meta"},{"$f":"IF($A95=0,\"\",OFFSET(PO!K$12,ROW(B95)-ROW(B$12),0))","v":"5."},{"$f":"IF(OFFSET(PO!N$12,ROW(C95)-ROW(C$12),0)=0,\"\",OFFSET(PO!N$12,ROW(C95)-ROW(C$12),0))","v":"PAREDES E PAINÉIS"},{"$f":"IF(OFFSET(PO!O$12,ROW(D95)-ROW(D$12),0)=0,\"\",OFFSET(PO!O$12,ROW(D95)-ROW(D$12),0))","v":""},{"$f":"IF($A95<>\"Serviço\",0,ROUND(SUMIF($F$9:$P$9,\"<>\",$F95:$P95),15-13*PO!$X$3))","v":0},{"$f":"OFFSET(PO!$P$12,ROW($E95)-ROW(F$12),0)","v":0}]
[{"$f":"OFFSET(PO!J$12,ROW(A96)-ROW($A$12),0)","v":"Nível 2"},{"$f":"IF($A96=0,\"\",OFFSET(PO!K$12,ROW(B96)-ROW(B$12),0))","v":"5.1."},{"$f":"IF(OFFSET(PO!N$12,ROW(C96)-ROW(C$12),0)=0,\"\",OFFSET(PO!N$12,ROW(C96)-ROW(C$12),0))","v":"ALVENARIA DE VEDAÇÃO"},{"$f":"IF(OFFSET(PO!O$12,ROW(D96)-ROW(D$12),0)=0,\"\",OFFSET(PO!O$12,ROW(D96)-ROW(D$12),0))","v":""},{"$f":"IF($A96<>\"Serviço\",0,ROUND(SUMIF($F$9:$P$9,\"<>\",$F96:$P96),15-13*PO!$X$3))","v":0},{"$f":"OFFSET(PO!$P$12,ROW($E96)-ROW(F$12),0)","v":0}]
[{"$f":"OFFSET(PO!J$12,ROW(A97)-ROW($A$12),0)","v":"Serviço"},{"$f":"IF($A97=0,\"\",OFFSET(PO!K$12,ROW(B97)-ROW(B$12),0))","v":"5.1.1."},{"$f":"IF(OFFSET(PO!N$12,ROW(C97)-ROW(C$12),0)=0,\"\",OFFSET(PO!N$12,ROW(C97)-ROW(C$12),0))","v":"ALVENARIA DE VEDAÇÃO DE BLOCOS CERÂMICOS FURADOS NA HORIZONTAL DE 11,5X19X19CM (ESPESSURA 11,5CM) DE PAREDES COM ÁREA LÍQUIDA MENOR QUE 6M² COM VÃOS E ARGAMASSA DE ASSENTAMENTO COM PREPARO EM BETONEIRA. AF_06/2014"},{"$f":"IF(OFFSET(PO!O$12,ROW(D97)-ROW(D$12),0)=0,\"\",OFFSET(PO!O$12,ROW(D97)-ROW(D$12),0))","v":"M2"},{"$f":"IF($A97<>\"Serviço\",0,ROUND(SUMIF($F$9:$P$9,\"<>\",$F97:$P97),15-13*PO!$X$3))","v":284.20999999999998},{"$f":"OFFSET(PO!$P$12,ROW($E97)-ROW(F$12),0)","v":284.20999999999998}]
[{"$f":"OFFSET(PO!J$12,ROW(A98)-ROW($A$12),0)","v":"Meta"},{"$f":"IF($A98=0,\"\",OFFSET(PO!K$12,ROW(B98)-ROW(B$12),0))","v":"6."},{"$f":"IF(OFFSET(PO!N$12,ROW(C98)-ROW(C$12),0)=0,\"\",OFFSET(PO!N$12,ROW(C98)-ROW(C$12),0))","v":"ESQUADRIAS"},{"$f":"IF(OFFSET(PO!O$12,ROW(D98)-ROW(D$12),0)=0,\"\",OFFSET(PO!O$12,ROW(D98)-ROW(D$12),0))","v":""},{"$f":"IF($A98<>\"Serviço\",0,ROUND(SUMIF($F$9:$P$9,\"<>\",$F98:$P98),15-13*PO!$X$3))","v":0},{"$f":"OFFSET(PO!$P$12,ROW($E98)-ROW(F$12),0)","v":0}]
[{"$f":"OFFSET(PO!J$12,ROW(A99)-ROW($A$12),0)","v":"Nível 2"},{"$f":"IF($A99=0,\"\",OFFSET(PO!K$12,ROW(B99)-ROW(B$12),0))","v":"6.1."},{"$f":"IF(OFFSET(PO!N$12,ROW(C99)-ROW(C$12),0)=0,\"\",OFFSET(PO!N$12,ROW(C99)-ROW(C$12),0))","v":"PORTAS DE VIDRO"},{"$f":"IF(OFFSET(PO!O$12,ROW(D99)-ROW(D$12),0)=0,\"\",OFFSET(PO!O$12,ROW(D99)-ROW(D$12),0))","v":""},{"$f":"IF($A99<>\"Serviço\",0,ROUND(SUMIF($F$9:$P$9,\"<>\",$F99:$P99),15-13*PO!$X$3))","v":0},{"$f":"OFFSET(PO!$P$12,ROW($E99)-ROW(F$12),0)","v":0}]
[{"$f":"OFFSET(PO!J$12,ROW(A100)-ROW($A$12),0)","v":"Serviço"},{"$f":"IF($A100=0,\"\",OFFSET(PO!K$12,ROW(B100)-ROW(B$12),0))","v":"6.1.1."},{"$f":"IF(OFFSET(PO!N$12,ROW(C100)-ROW(C$12),0)=0,\"\",OFFSET(PO!N$12,ROW(C100)-ROW(C$12),0))","v":"PORTA DE CORRER EM ALUMINIO, COM DUAS FOLHAS PARA VIDRO, INCLUSO VIDRO LISO INCOLOR, FECHADURA E PUXADOR, SEM GUARNICAO/ALIZAR/VISTA"},{"$f":"IF(OFFSET(PO!O$12,ROW(D100)-ROW(D$12),0)=0,\"\",OFFSET(PO!O$12,ROW(D100)-ROW(D$12),0))","v":"M2"},{"$f":"IF($A100<>\"Serviço\",0,ROUND(SUMIF($F$9:$P$9,\"<>\",$F100:$P100),15-13*PO!$X$3))","v":9.4499999999999993},{"$f":"OFFSET(PO!$P$12,ROW($E100)-ROW(F$12),0)","v":9.4499999999999993}]
[{"$f":"OFFSET(PO!J$12,ROW(A101)-ROW($A$12),0)","v":"Nível 2"},{"$f":"IF($A101=0,\"\",OFFSET(PO!K$12,ROW(B101)-ROW(B$12),0))","v":"6.2."},{"$f":"IF(OFFSET(PO!N$12,ROW(C101)-ROW(C$12),0)=0,\"\",OFFSET(PO!N$12,ROW(C101)-ROW(C$12),0))","v":"PORTA DE MADEIRA"},{"$f":"IF(OFFSET(PO!O$12,ROW(D101)-ROW(D$12),0)=0,\"\",OFFSET(PO!O$12,ROW(D101)-ROW(D$12),0))","v":""},{"$f":"IF($A101<>\"Serviço\",0,ROUND(SUMIF($F$9:$P$9,\"<>\",$F101:$P101),15-13*PO!$X$3))","v":0},{"$f":"OFFSET(PO!$P$12,ROW($E101)-ROW(F$12),0)","v":0}]
[{"$f":"OFFSET(PO!J$12,ROW(A102)-ROW($A$12),0)","v":"Serviço"},{"$f":"IF($A102=0,\"\",OFFSET(PO!K$12,ROW(B102)-ROW(B$12),0))","v":"6.2.1."},{"$f":"IF(OFFSET(PO!N$12,ROW(C102)-ROW(C$12),0)=0,\"\",OFFSET(PO!N$12,ROW(C102)-ROW(C$12),0))","v":"KIT DE PORTA DE MADEIRA PARA PINTURA, SEMI-OCA (LEVE OU MÉDIA), PADRÃO MÉDIO, 80X210CM, ESPESSURA DE 3,5CM, ITENS INCLUSOS: DOBRADIÇAS, MONTAGEM E INSTALAÇÃO DO BATENTE, FECHADURA COM EXECUÇÃO DO FURO - FORNECIMENTO E INSTALAÇÃO. AF_08/2015"},{"$f":"IF(OFFSET(PO!O$12,ROW(D102)-ROW(D$12),0)=0,\"\",OFFSET(PO!O$12,ROW(D102)-ROW(D$12),0))","v":"UN"},{"$f":"IF($A102<>\"Serviço\",0,ROUND(SUMIF($F$9:$P$9,\"<>\",$F102:$P102),15-13*PO!$X$3))","v":6},{"$f":"OFFSET(PO!$P$12,ROW($E102)-ROW(F$12),0)","v":6}]
[{"$f":"OFFSET(PO!J$12,ROW(A103)-ROW($A$12),0)","v":"Serviço"},{"$f":"IF($A103=0,\"\",OFFSET(PO!K$12,ROW(B103)-ROW(B$12),0))","v":"6.2.2."},{"$f":"IF(OFFSET(PO!N$12,ROW(C103)-ROW(C$12),0)=0,\"\",OFFSET(PO!N$12,ROW(C103)-ROW(C$12),0))","v":"KIT DE PORTA DE MADEIRA PARA PINTURA, SEMI-OCA (LEVE OU MÉDIA), PADRÃO MÉDIO, 60X210CM, ESPESSURA DE 3,5CM, ITENS INCLUSOS: DOBRADIÇAS, MONTAGEM E INSTALAÇÃO DO BATENTE, FECHADURA COM EXECUÇÃO DO FURO - FORNECIMENTO E INSTALAÇÃO. AF_08/2015"},{"$f":"IF(OFFSET(PO!O$12,ROW(D103)-ROW(D$12),0)=0,\"\",OFFSET(PO!O$12,ROW(D103)-ROW(D$12),0))","v":"UN"},{"$f":"IF($A103<>\"Serviço\",0,ROUND(SUMIF($F$9:$P$9,\"<>\",$F103:$P103),15-13*PO!$X$3))","v":2},{"$f":"OFFSET(PO!$P$12,ROW($E103)-ROW(F$12),0)","v":2}]
[{"$f":"OFFSET(PO!J$12,ROW(A104)-ROW($A$12),0)","v":"Serviço"},{"$f":"IF($A104=0,\"\",OFFSET(PO!K$12,ROW(B104)-ROW(B$12),0))","v":"6.2.3."},{"$f":"IF(OFFSET(PO!N$12,ROW(C104)-ROW(C$12),0)=0,\"\",OFFSET(PO!N$12,ROW(C104)-ROW(C$12),0))","v":"PORTA DE MADEIRA COMPENSADA LISA PARA PINTURA, 120X210X3,5CM, 2 FOLHAS, INCLUSO ADUELA 2A, ALIZAR 2A E DOBRADICAS"},{"$f":"IF(OFFSET(PO!O$12,ROW(D104)-ROW(D$12),0)=0,\"\",OFFSET(PO!O$12,ROW(D104)-ROW(D$12),0))","v":"UN"},{"$f":"IF($A104<>\"Serviço\",0,ROUND(SUMIF($F$9:$P$9,\"<>\",$F104:$P104),15-13*PO!$X$3))","v":2},{"$f":"OFFSET(PO!$P$12,ROW($E104)-ROW(F$12),0)","v":2}]
[{"$f":"OFFSET(PO!J$12,ROW(A105)-ROW($A$12),0)","v":"Serviço"},{"$f":"IF($A105=0,\"\",OFFSET(PO!K$12,ROW(B105)-ROW(B$12),0))","v":"6.2.4."},{"$f":"IF(OFFSET(PO!N$12,ROW(C105)-ROW(C$12),0)=0,\"\",OFFSET(PO!N$12,ROW(C105)-ROW(C$12),0))","v":"KIT DE PORTA DE MADEIRA PARA PINTURA, SEMI-OCA (LEVE OU MÉDIA), PADRÃO MÉDIO, 90X210CM, ESPESSURA DE 3,5CM, ITENS INCLUSOS: DOBRADIÇAS, MONTAGEM E INSTALAÇÃO DO BATENTE, FECHADURA COM EXECUÇÃO DO FURO - FORNECIMENTO E INSTALAÇÃO. AF_08/2015"},{"$f":"IF(OFFSET(PO!O$12,ROW(D105)-ROW(D$12),0)=0,\"\",OFFSET(PO!O$12,ROW(D105)-ROW(D$12),0))","v":"UN"},{"$f":"IF($A105<>\"Serviço\",0,ROUND(SUMIF($F$9:$P$9,\"<>\",$F105:$P105),15-13*PO!$X$3))","v":2},{"$f":"OFFSET(PO!$P$12,ROW($E105)-ROW(F$12),0)","v":2}]
[{"$f":"OFFSET(PO!J$12,ROW(A106)-ROW($A$12),0)","v":"Serviço"},{"$f":"IF($A106=0,\"\",OFFSET(PO!K$12,ROW(B106)-ROW(B$12),0))","v":"6.2.5."},{"$f":"IF(OFFSET(PO!N$12,ROW(C106)-ROW(C$12),0)=0,\"\",OFFSET(PO!N$12,ROW(C106)-ROW(C$12),0))","v":"FECHADURA DE EMBUTIR PARA PORTAS INTERNAS, COMPLETA, ACABAMENTO PADRÃO MÉDIO, COM EXECUÇÃO DE FURO - FORNECIMENTO E INSTALAÇÃO. AF_08/2015"},{"$f":"IF(OFFSET(PO!O$12,ROW(D106)-ROW(D$12),0)=0,\"\",OFFSET(PO!O$12,ROW(D106)-ROW(D$12),0))","v":"UN"},{"$f":"IF($A106<>\"Serviço\",0,ROUND(SUMIF($F$9:$P$9,\"<>\",$F106:$P106),15-13*PO!$X$3))","v":2},{"$f":"OFFSET(PO!$P$12,ROW($E106)-ROW(F$12),0)","v":2}]
[{"$f":"OFFSET(PO!J$12,ROW(A107)-ROW($A$12),0)","v":"Serviço"},{"$f":"IF($A107=0,\"\",OFFSET(PO!K$12,ROW(B107)-ROW(B$12),0))","v":"6.2.6."},{"$f":"IF(OFFSET(PO!N$12,ROW(C107)-ROW(C$12),0)=0,\"\",OFFSET(PO!N$12,ROW(C107)-ROW(C$12),0))","v":"CHAPA ACO INOX AISI 304 NUMERO 4 (E = 6 MM), ACABAMENTO NUMERO 1 (LAMINADO A QUENTE, FOSCO)"},{"$f":"IF(OFFSET(PO!O$12,ROW(D107)-ROW(D$12),0)=0,\"\",OFFSET(PO!O$12,ROW(D107)-ROW(D$12),0))","v":"M2"},{"$f":"IF($A107<>\"Serviço\",0,ROUND(SUMIF($F$9:$P$9,\"<>\",$F107:$P107),15-13*PO!$X$3))","v":0.72},{"$f":"OFFSET(PO!$P$12,ROW($E107)-ROW(F$12),0)","v":0.72}]
[{"$f":"OFFSET(PO!J$12,ROW(A108)-ROW($A$12),0)","v":"Serviço"},{"$f":"IF($A108=0,\"\",OFFSET(PO!K$12,ROW(B108)-ROW(B$12),0))","v":"6.2.7."},{"$f":"IF(OFFSET(PO!N$12,ROW(C108)-ROW(C$12),0)=0,\"\",OFFSET(PO!N$12,ROW(C108)-ROW(C$12),0))","v":"BARRA DE APOIO RETA, EM ACO INOX POLIDO, COMPRIMENTO 60CM, DIAMETRO MINIMO 3 CM"},{"$f":"IF(OFFSET(PO!O$12,ROW(D108)-ROW(D$12),0)=0,\"\",OFFSET(PO!O$12,ROW(D108)-ROW(D$12),0))","v":"UN"},{"$f":"IF($A108<>\"Serviço\",0,ROUND(SUMIF($F$9:$P$9,\"<>\",$F108:$P108),15-13*PO!$X$3))","v":2},{"$f":"OFFSET(PO!$P$12,ROW($E108)-ROW(F$12),0)","v":2}]
[{"$f":"OFFSET(PO!J$12,ROW(A109)-ROW($A$12),0)","v":"Nível 2"},{"$f":"IF($A109=0,\"\",OFFSET(PO!K$12,ROW(B109)-ROW(B$12),0))","v":"6.3."},{"$f":"IF(OFFSET(PO!N$12,ROW(C109)-ROW(C$12),0)=0,\"\",OFFSET(PO!N$12,ROW(C109)-ROW(C$12),0))","v":"PORTAS METÁLICAS"},{"$f":"IF(OFFSET(PO!O$12,ROW(D109)-ROW(D$12),0)=0,\"\",OFFSET(PO!O$12,ROW(D109)-ROW(D$12),0))","v":""},{"$f":"IF($A109<>\"Serviço\",0,ROUND(SUMIF($F$9:$P$9,\"<>\",$F109:$P109),15-13*PO!$X$3))","v":0},{"$f":"OFFSET(PO!$P$12,ROW($E109)-ROW(F$12),0)","v":0}]
[{"$f":"OFFSET(PO!J$12,ROW(A110)-ROW($A$12),0)","v":"Serviço"},{"$f":"IF($A110=0,\"\",OFFSET(PO!K$12,ROW(B110)-ROW(B$12),0))","v":"6.3.1."},{"$f":"IF(OFFSET(PO!N$12,ROW(C110)-ROW(C$12),0)=0,\"\",OFFSET(PO!N$12,ROW(C110)-ROW(C$12),0))","v":"PORTAO DE FERRO COM VARA 1/2\", COM REQUADRO"},{"$f":"IF(OFFSET(PO!O$12,ROW(D110)-ROW(D$12),0)=0,\"\",OFFSET(PO!O$12,ROW(D110)-ROW(D$12),0))","v":"M2"},{"$f":"IF($A110<>\"Serviço\",0,ROUND(SUMIF($F$9:$P$9,\"<>\",$F110:$P110),15-13*PO!$X$3))","v":1.89},{"$f":"OFFSET(PO!$P$12,ROW($E110)-ROW(F$12),0)","v":1.89}]
[{"$f":"OFFSET(PO!J$12,ROW(A111)-ROW($A$12),0)","v":"Serviço"},{"$f":"IF($A111=0,\"\",OFFSET(PO!K$12,ROW(B111)-ROW(B$12),0))","v":"6.3.2."},{"$f":"IF(OFFSET(PO!N$12,ROW(C111)-ROW(C$12),0)=0,\"\",OFFSET(PO!N$12,ROW(C111)-ROW(C$12),0))","v":"PORTA DE FERRO, DE ABRIR, TIPO GRADE COM CHAPA, 87X210CM, COM GUARNICOES"},{"$f":"IF(OFFSET(PO!O$12,ROW(D111)-ROW(D$12),0)=0,\"\",OFFSET(PO!O$12,ROW(D111)-ROW(D$12),0))","v":"M2"},{"$f":"IF($A111<>\"Serviço\",0,ROUND(SUMIF($F$9:$P$9,\"<>\",$F111:$P111),15-13*PO!$X$3))","v":0.83},{"$f":"OFFSET(PO!$P$12,ROW($E111)-ROW(F$12),0)","v":0.83}]
[{"$f":"OFFSET(PO!J$12,ROW(A112)-ROW($A$12),0)","v":"Nível 2"},{"$f":"IF($A112=0,\"\",OFFSET(PO!K$12,ROW(B112)-ROW(B$12),0))","v":"6.4."},{"$f":"IF(OFFSET(PO!N$12,ROW(C112)-ROW(C$12),0)=0,\"\",OFFSET(PO!N$12,ROW(C112)-ROW(C$12),0))","v":"PORTA EM ALUMÍNIO"},{"$f":"IF(OFFSET(PO!O$12,ROW(D112)-ROW(D$12),0)=0,\"\",OFFSET(PO!O$12,ROW(D112)-ROW(D$12),0))","v":""},{"$f":"IF($A112<>\"Serviço\",0,ROUND(SUMIF($F$9:$P$9,\"<>\",$F112:$P112),15-13*PO!$X$3))","v":0},{"$f":"OFFSET(PO!$P$12,ROW($E112)-ROW(F$12),0)","v":0}]
[{"$f":"OFFSET(PO!J$12,ROW(A113)-ROW($A$12),0)","v":"Serviço"},{"$f":"IF($A113=0,\"\",OFFSET(PO!K$12,ROW(B113)-ROW(B$12),0))","v":"6.4.1."},{"$f":"IF(OFFSET(PO!N$12,ROW(C113)-ROW(C$12),0)=0,\"\",OFFSET(PO!N$12,ROW(C113)-ROW(C$12),0))","v":"PORTA EM ALUMÍNIO DE ABRIR TIPO VENEZIANA COM GUARNIÇÃO, FIXAÇÃO COM PARAFUSOS - FORNECIMENTO E INSTALAÇÃO. AF_08/2015"},{"$f":"IF(OFFSET(PO!O$12,ROW(D113)-ROW(D$12),0)=0,\"\",OFFSET(PO!O$12,ROW(D113)-ROW(D$12),0))","v":"M2"},{"$f":"IF($A113<>\"Serviço\",0,ROUND(SUMIF($F$9:$P$9,\"<>\",$F113:$P113),15-13*PO!$X$3))","v":1.68},{"$f":"OFFSET(PO!$P$12,ROW($E113)-ROW(F$12),0)","v":1.68}]
[{"$f":"OFFSET(PO!J$12,ROW(A114)-ROW($A$12),0)","v":"Nível 2"},{"$f":"IF($A114=0,\"\",OFFSET(PO!K$12,ROW(B114)-ROW(B$12),0))","v":"6.5."},{"$f":"IF(OFFSET(PO!N$12,ROW(C114)-ROW(C$12),0)=0,\"\",OFFSET(PO!N$12,ROW(C114)-ROW(C$12),0))","v":"JANELAS EM ALUMÍNIO"},{"$f":"IF(OFFSET(PO!O$12,ROW(D114)-ROW(D$12),0)=0,\"\",OFFSET(PO!O$12,ROW(D114)-ROW(D$12),0))","v":""},{"$f":"IF($A114<>\"Serviço\",0,ROUND(SUMIF($F$9:$P$9,\"<>\",$F114:$P114),15-13*PO!$X$3))","v":0},{"$f":"OFFSET(PO!$P$12,ROW($E114)-ROW(F$12),0)","v":0}]
[{"$f":"OFFSET(PO!J$12,ROW(A115)-ROW($A$12),0)","v":"Serviço"},{"$f":"IF($A115=0,\"\",OFFSET(PO!K$12,ROW(B115)-ROW(B$12),0))","v":"6.5.1."},{"$f":"IF(OFFSET(PO!N$12,ROW(C115)-ROW(C$12),0)=0,\"\",OFFSET(PO!N$12,ROW(C115)-ROW(C$12),0))","v":"JANELA DE ALUMÍNIO MAXIM-AR, FIXAÇÃO COM ARGAMASSA, COM VIDROS, PADRONIZADA. AF_07/2016"},{"$f":"IF(OFFSET(PO!O$12,ROW(D115)-ROW(D$12),0)=0,\"\",OFFSET(PO!O$12,ROW(D115)-ROW(D$12),0))","v":"M2"},{"$f":"IF($A115<>\"Serviço\",0,ROUND(SUMIF($F$9:$P$9,\"<>\",$F115:$P115),15-13*PO!$X$3))","v":4},{"$f":"OFFSET(PO!$P$12,ROW($E115)-ROW(F$12),0)","v":4}]
[{"$f":"OFFSET(PO!J$12,ROW(A116)-ROW($A$12),0)","v":"Serviço"},{"$f":"IF($A116=0,\"\",OFFSET(PO!K$12,ROW(B116)-ROW(B$12),0))","v":"6.5.2."},{"$f":"IF(OFFSET(PO!N$12,ROW(C116)-ROW(C$12),0)=0,\"\",OFFSET(PO!N$12,ROW(C116)-ROW(C$12),0))","v":"JANELA DE ALUMÍNIO DE CORRER, 2 FOLHAS, FIXAÇÃO COM ARGAMASSA, COM VIDROS, PADRONIZADA. AF_07/2016"},{"$f":"IF(OFFSET(PO!O$12,ROW(D116)-ROW(D$12),0)=0,\"\",OFFSET(PO!O$12,ROW(D116)-ROW(D$12),0))","v":"M2"},{"$f":"IF($A116<>\"Serviço\",0,ROUND(SUMIF($F$9:$P$9,\"<>\",$F116:$P116),15-13*PO!$X$3))","v":19.64},{"$f":"OFFSET(PO!$P$12,ROW($E116)-ROW(F$12),0)","v":19.64}]
[{"$f":"OFFSET(PO!J$12,ROW(A117)-ROW($A$12),0)","v":"Meta"},{"$f":"IF($A117=0,\"\",OFFSET(PO!K$12,ROW(B117)-ROW(B$12),0))","v":"7."},{"$f":"IF(OFFSET(PO!N$12,ROW(C117)-ROW(C$12),0)=0,\"\",OFFSET(PO!N$12,ROW(C117)-ROW(C$12),0))","v":"COBERTURA"},{"$f":"IF(OFFSET(PO!O$12,ROW(D117)-ROW(D$12),0)=0,\"\",OFFSET(PO!O$12,ROW(D117)-ROW(D$12),0))","v":""},{"$f":"IF($A117<>\"Serviço\",0,ROUND(SUMIF($F$9:$P$9,\"<>\",$F117:$P117),15-13*PO!$X$3))","v":0},{"$f":"OFFSET(PO!$P$12,ROW($E117)-ROW(F$12),0)","v":0}]
[{"$f":"OFFSET(PO!J$12,ROW(A118)-ROW($A$12),0)","v":"Serviço"},{"$f":"IF($A118=0,\"\",OFFSET(PO!K$12,ROW(B118)-ROW(B$12),0))","v":"7.0.1."},{"$f":"IF(OFFSET(PO!N$12,ROW(C118)-ROW(C$12),0)=0,\"\",OFFSET(PO!N$12,ROW(C118)-ROW(C$12),0))","v":"TRAMA DE MADEIRA COMPOSTA POR TERÇAS PARA TELHADOS DE ATÉ 2 ÁGUAS PARA TELHA ONDULADA DE FIBROCIMENTO, METÁLICA, PLÁSTICA OU TERMOACÚSTICA, INCLUSO TRANSPORTE VERTICAL. AF_12/2015"},{"$f":"IF(OFFSET(PO!O$12,ROW(D118)-ROW(D$12),0)=0,\"\",OFFSET(PO!O$12,ROW(D118)-ROW(D$12),0))","v":"M2"},{"$f":"IF($A118<>\"Serviço\",0,ROUND(SUMIF($F$9:$P$9,\"<>\",$F118:$P118),15-13*PO!$X$3))","v":112.13},{"$f":"OFFSET(PO!$P$12,ROW($E118)-ROW(F$12),0)","v":112.13}]
[{"$f":"OFFSET(PO!J$12,ROW(A119)-ROW($A$12),0)","v":"Serviço"},{"$f":"IF($A119=0,\"\",OFFSET(PO!K$12,ROW(B119)-ROW(B$12),0))","v":"7.0.2."},{"$f":"IF(OFFSET(PO!N$12,ROW(C119)-ROW(C$12),0)=0,\"\",OFFSET(PO!N$12,ROW(C119)-ROW(C$12),0))","v":"TRAMA DE AÇO COMPOSTA POR TERÇAS PARA TELHADOS DE ATÉ 2 ÁGUAS PARA TELHA ONDULADA DE FIBROCIMENTO, METÁLICA, PLÁSTICA OU TERMOACÚSTICA, INCLUSO TRANSPORTE VERTICAL. AF_12/2015"},{"$f":"IF(OFFSET(PO!O$12,ROW(D119)-ROW(D$12),0)=0,\"\",OFFSET(PO!O$12,ROW(D119)-ROW(D$12),0))","v":"M2"},{"$f":"IF($A119<>\"Serviço\",0,ROUND(SUMIF($F$9:$P$9,\"<>\",$F119:$P119),15-13*PO!$X$3))","v":8.4700000000000006},{"$f":"OFFSET(PO!$P$12,ROW($E119)-ROW(F$12),0)","v":8.4700000000000006}]
[{"$f":"OFFSET(PO!J$12,ROW(A120)-ROW($A$12),0)","v":"Serviço"},{"$f":"IF($A120=0,\"\",OFFSET(PO!K$12,ROW(B120)-ROW(B$12),0))","v":"7.0.3."},{"$f":"IF(OFFSET(PO!N$12,ROW(C120)-ROW(C$12),0)=0,\"\",OFFSET(PO!N$12,ROW(C120)-ROW(C$12),0))","v":"TELHAMENTO COM TELHA DE AÇO/ALUMÍNIO E = 0,5 MM, COM ATÉ 2 ÁGUAS, INCLUSO IÇAMENTO. AF_06/2016"},{"$f":"IF(OFFSET(PO!O$12,ROW(D120)-ROW(D$12),0)=0,\"\",OFFSET(PO!O$12,ROW(D120)-ROW(D$12),0))","v":"M2"},{"$f":"IF($A120<>\"Serviço\",0,ROUND(SUMIF($F$9:$P$9,\"<>\",$F120:$P120),15-13*PO!$X$3))","v":124.47},{"$f":"OFFSET(PO!$P$12,ROW($E120)-ROW(F$12),0)","v":124.47}]
[{"$f":"OFFSET(PO!J$12,ROW(A121)-ROW($A$12),0)","v":"Serviço"},{"$f":"IF($A121=0,\"\",OFFSET(PO!K$12,ROW(B121)-ROW(B$12),0))","v":"7.0.4."},{"$f":"IF(OFFSET(PO!N$12,ROW(C121)-ROW(C$12),0)=0,\"\",OFFSET(PO!N$12,ROW(C121)-ROW(C$12),0))","v":"CUMEEIRA EM PERFIL ONDULADO DE ALUMÍNIO"},{"$f":"IF(OFFSET(PO!O$12,ROW(D121)-ROW(D$12),0)=0,\"\",OFFSET(PO!O$12,ROW(D121)-ROW(D$12),0))","v":"M"},{"$f":"IF($A121<>\"Serviço\",0,ROUND(SUMIF($F$9:$P$9,\"<>\",$F121:$P121),15-13*PO!$X$3))","v":12.1},{"$f":"OFFSET(PO!$P$12,ROW($E121)-ROW(F$12),0)","v":12.1}]
[{"$f":"OFFSET(PO!J$12,ROW(A122)-ROW($A$12),0)","v":"Serviço"},{"$f":"IF($A122=0,\"\",OFFSET(PO!K$12,ROW(B122)-ROW(B$12),0))","v":"7.0.5."},{"$f":"IF(OFFSET(PO!N$12,ROW(C122)-ROW(C$12),0)=0,\"\",OFFSET(PO!N$12,ROW(C122)-ROW(C$12),0))","v":"CALHA EM CHAPA DE AÇO GALVANIZADO NÚMERO 24, DESENVOLVIMENTO DE 100 CM, INCLUSO TRANSPORTE VERTICAL. AF_06/2016"},{"$f":"IF(OFFSET(PO!O$12,ROW(D122)-ROW(D$12),0)=0,\"\",OFFSET(PO!O$12,ROW(D122)-ROW(D$12),0))","v":"M"},{"$f":"IF($A122<>\"Serviço\",0,ROUND(SUMIF($F$9:$P$9,\"<>\",$F122:$P122),15-13*PO!$X$3))","v":27.2},{"$f":"OFFSET(PO!$P$12,ROW($E122)-ROW(F$12),0)","v":27.2}]
[{"$f":"OFFSET(PO!J$12,ROW(A123)-ROW($A$12),0)","v":"Serviço"},{"$f":"IF($A123=0,\"\",OFFSET(PO!K$12,ROW(B123)-ROW(B$12),0))","v":"7.0.6."},{"$f":"IF(OFFSET(PO!N$12,ROW(C123)-ROW(C$12),0)=0,\"\",OFFSET(PO!N$12,ROW(C123)-ROW(C$12),0))","v":"CALHA EM CHAPA DE AÇO GALVANIZADO NÚMERO 24, DESENVOLVIMENTO DE 50 CM, INCLUSO TRANSPORTE VERTICAL. AF_06/2016"},{"$f":"IF(OFFSET(PO!O$12,ROW(D123)-ROW(D$12),0)=0,\"\",OFFSET(PO!O$12,ROW(D123)-ROW(D$12),0))","v":"M"},{"$f":"IF($A123<>\"Serviço\",0,ROUND(SUMIF($F$9:$P$9,\"<>\",$F123:$P123),15-13*PO!$X$3))","v":3.15},{"$f":"OFFSET(PO!$P$12,ROW($E123)-ROW(F$12),0)","v":3.15}]
[{"$f":"OFFSET(PO!J$12,ROW(A124)-ROW($A$12),0)","v":"Serviço"},{"$f":"IF($A124=0,\"\",OFFSET(PO!K$12,ROW(B124)-ROW(B$12),0))","v":"7.0.7."},{"$f":"IF(OFFSET(PO!N$12,ROW(C124)-ROW(C$12),0)=0,\"\",OFFSET(PO!N$12,ROW(C124)-ROW(C$12),0))","v":"RUFO EM CHAPA DE AÇO GALVANIZADO NÚMERO 24, DESENVOLVIMENTO DE 100 CM, INCLUSO TRANSPORTE VERTICAL"},{"$f":"IF(OFFSET(PO!O$12,ROW(D124)-ROW(D$12),0)=0,\"\",OFFSET(PO!O$12,ROW(D124)-ROW(D$12),0))","v":"M"},{"$f":"IF($A124<>\"Serviço\",0,ROUND(SUMIF($F$9:$P$9,\"<>\",$F124:$P124),15-13*PO!$X$3))","v":27.2},{"$f":"OFFSET(PO!$P$12,ROW($E124)-ROW(F$12),0)","v":27.2}]
[{"$f":"OFFSET(PO!J$12,ROW(A125)-ROW($A$12),0)","v":"Serviço"},{"$f":"IF($A125=0,\"\",OFFSET(PO!K$12,ROW(B125)-ROW(B$12),0))","v":"7.0.8."},{"$f":"IF(OFFSET(PO!N$12,ROW(C125)-ROW(C$12),0)=0,\"\",OFFSET(PO!N$12,ROW(C125)-ROW(C$12),0))","v":"RUFO EM CHAPA DE AÇO GALVANIZADO NÚMERO 24, DESENVOLVIMENTO MÉDIO DE 50 CM, INCLUSO TRANSPORTE VERTICAL"},{"$f":"IF(OFFSET(PO!O$12,ROW(D125)-ROW(D$12),0)=0,\"\",OFFSET(PO!O$12,ROW(D125)-ROW(D$12),0))","v":"M"},{"$f":"IF($A125<>\"Serviço\",0,ROUND(SUMIF($F$9:$P$9,\"<>\",$F125:$P125),15-13*PO!$X$3))","v":40.58},{"$f":"OFFSET(PO!$P$12,ROW($E125)-ROW(F$12),0)","v":40.58}]
[{"$f":"OFFSET(PO!J$12,ROW(A126)-ROW($A$12),0)","v":"Serviço"},{"$f":"IF($A126=0,\"\",OFFSET(PO!K$12,ROW(B126)-ROW(B$12),0))","v":"7.0.9."},{"$f":"IF(OFFSET(PO!N$12,ROW(C126)-ROW(C$12),0)=0,\"\",OFFSET(PO!N$12,ROW(C126)-ROW(C$12),0))","v":"CHAPIM DE CONCRETO APARENTE COM ACABAMENTO DESEMPENADO, FORMA DE COMPENSADO PLASTIFICADO (MADEIRIT) DE 14 X 10 CM, FUNDIDO NO LOCAL."},{"$f":"IF(OFFSET(PO!O$12,ROW(D126)-ROW(D$12),0)=0,\"\",OFFSET(PO!O$12,ROW(D126)-ROW(D$12),0))","v":"M"},{"$f":"IF($A126<>\"Serviço\",0,ROUND(SUMIF($F$9:$P$9,\"<>\",$F126:$P126),15-13*PO!$X$3))","v":14.55},{"$f":"OFFSET(PO!$P$12,ROW($E126)-ROW(F$12),0)","v":14.55}]
[{"$f":"OFFSET(PO!J$12,ROW(A127)-ROW($A$12),0)","v":"Serviço"},{"$f":"IF($A127=0,\"\",OFFSET(PO!K$12,ROW(B127)-ROW(B$12),0))","v":"7.0.10."},{"$f":"IF(OFFSET(PO!N$12,ROW(C127)-ROW(C$12),0)=0,\"\",OFFSET(PO!N$12,ROW(C127)-ROW(C$12),0))","v":"MANTA IMPERMEABILIZANTE A BASE DE ASFALTO - FORNECIMENTO E INSTALACAO"},{"$f":"IF(OFFSET(PO!O$12,ROW(D127)-ROW(D$12),0)=0,\"\",OFFSET(PO!O$12,ROW(D127)-ROW(D$12),0))","v":"M2"},{"$f":"IF($A127<>\"Serviço\",0,ROUND(SUMIF($F$9:$P$9,\"<>\",$F127:$P127),15-13*PO!$X$3))","v":0.62},{"$f":"OFFSET(PO!$P$12,ROW($E127)-ROW(F$12),0)","v":0.62}]
[{"$f":"OFFSET(PO!J$12,ROW(A128)-ROW($A$12),0)","v":"Serviço"},{"$f":"IF($A128=0,\"\",OFFSET(PO!K$12,ROW(B128)-ROW(B$12),0))","v":"7.0.11."},{"$f":"IF(OFFSET(PO!N$12,ROW(C128)-ROW(C$12),0)=0,\"\",OFFSET(PO!N$12,ROW(C128)-ROW(C$12),0))","v":"IMPERMEABILIZAÇÃO DE PISO COM ARGAMASSA DE CIMENTO E AREIA, COM ADITIVO IMPERMEABILIZANTE, E = 2CM. AF_06/2018"},{"$f":"IF(OFFSET(PO!O$12,ROW(D128)-ROW(D$12),0)=0,\"\",OFFSET(PO!O$12,ROW(D128)-ROW(D$12),0))","v":"M2"},{"$f":"IF($A128<>\"Serviço\",0,ROUND(SUMIF($F$9:$P$9,\"<>\",$F128:$P128),15-13*PO!$X$3))","v":8.16},{"$f":"OFFSET(PO!$P$12,ROW($E128)-ROW(F$12),0)","v":8.16}]
[{"$f":"OFFSET(PO!J$12,ROW(A129)-ROW($A$12),0)","v":"Meta"},{"$f":"IF($A129=0,\"\",OFFSET(PO!K$12,ROW(B129)-ROW(B$12),0))","v":"8."},{"$f":"IF(OFFSET(PO!N$12,ROW(C129)-ROW(C$12),0)=0,\"\",OFFSET(PO!N$12,ROW(C129)-ROW(C$12),0))","v":"IMPERMEABILIZAÇÃO"},{"$f":"IF(OFFSET(PO!O$12,ROW(D129)-ROW(D$12),0)=0,\"\",OFFSET(PO!O$12,ROW(D129)-ROW(D$12),0))","v":""},{"$f":"IF($A129<>\"Serviço\",0,ROUND(SUMIF($F$9:$P$9,\"<>\",$F129:$P129),15-13*PO!$X$3))","v":0},{"$f":"OFFSET(PO!$P$12,ROW($E129)-ROW(F$12),0)","v":0}]
[{"$f":"OFFSET(PO!J$12,ROW(A130)-ROW($A$12),0)","v":"Serviço"},{"$f":"IF($A130=0,\"\",OFFSET(PO!K$12,ROW(B130)-ROW(B$12),0))","v":"8.0.1."},{"$f":"IF(OFFSET(PO!N$12,ROW(C130)-ROW(C$12),0)=0,\"\",OFFSET(PO!N$12,ROW(C130)-ROW(C$12),0))","v":"IMPERMEABILIZACAO DE ESTRUTURAS ENTERRADAS, COM TINTA ASFALTICA, DUAS DEMAOS."},{"$f":"IF(OFFSET(PO!O$12,ROW(D130)-ROW(D$12),0)=0,\"\",OFFSET(PO!O$12,ROW(D130)-ROW(D$12),0))","v":"M2"},{"$f":"IF($A130<>\"Serviço\",0,ROUND(SUMIF($F$9:$P$9,\"<>\",$F130:$P130),15-13*PO!$X$3))","v":64.38},{"$f":"OFFSET(PO!$P$12,ROW($E130)-ROW(F$12),0)","v":64.38}]
[{"$f":"OFFSET(PO!J$12,ROW(A131)-ROW($A$12),0)","v":"Serviço"},{"$f":"IF($A131=0,\"\",OFFSET(PO!K$12,ROW(B131)-ROW(B$12),0))","v":"8.0.2."},{"$f":"IF(OFFSET(PO!N$12,ROW(C131)-ROW(C$12),0)=0,\"\",OFFSET(PO!N$12,ROW(C131)-ROW(C$12),0))","v":"IMPERMEABILIZAÇÃO DE SUPERFÍCIE COM MANTA ASFÁLTICA, UMA CAMADA, INCLUSIVE APLICAÇÃO DE PRIMER ASFÁLTICO, E=3MM. AF_06/2018"},{"$f":"IF(OFFSET(PO!O$12,ROW(D131)-ROW(D$12),0)=0,\"\",OFFSET(PO!O$12,ROW(D131)-ROW(D$12),0))","v":"M2"},{"$f":"IF($A131<>\"Serviço\",0,ROUND(SUMIF($F$9:$P$9,\"<>\",$F131:$P131),15-13*PO!$X$3))","v":28.62},{"$f":"OFFSET(PO!$P$12,ROW($E131)-ROW(F$12),0)","v":28.62}]
[{"$f":"OFFSET(PO!J$12,ROW(A132)-ROW($A$12),0)","v":"Serviço"},{"$f":"IF($A132=0,\"\",OFFSET(PO!K$12,ROW(B132)-ROW(B$12),0))","v":"8.0.3."},{"$f":"IF(OFFSET(PO!N$12,ROW(C132)-ROW(C$12),0)=0,\"\",OFFSET(PO!N$12,ROW(C132)-ROW(C$12),0))","v":"PROTEÇÃO MECÂNICA DE SUPERFICIE HORIZONTAL COM ARGAMASSA DE CIMENTO E AREIA, TRAÇO 1:3, E=3CM. AF_06/2018"},{"$f":"IF(OFFSET(PO!O$12,ROW(D132)-ROW(D$12),0)=0,\"\",OFFSET(PO!O$12,ROW(D132)-ROW(D$12),0))","v":"M2"},{"$f":"IF($A132<>\"Serviço\",0,ROUND(SUMIF($F$9:$P$9,\"<>\",$F132:$P132),15-13*PO!$X$3))","v":28.62},{"$f":"OFFSET(PO!$P$12,ROW($E132)-ROW(F$12),0)","v":28.62}]
[{"$f":"OFFSET(PO!J$12,ROW(A133)-ROW($A$12),0)","v":"Meta"},{"$f":"IF($A133=0,\"\",OFFSET(PO!K$12,ROW(B133)-ROW(B$12),0))","v":"9."},{"$f":"IF(OFFSET(PO!N$12,ROW(C133)-ROW(C$12),0)=0,\"\",OFFSET(PO!N$12,ROW(C133)-ROW(C$12),0))","v":"REVESTIMENTOS"},{"$f":"IF(OFFSET(PO!O$12,ROW(D133)-ROW(D$12),0)=0,\"\",OFFSET(PO!O$12,ROW(D133)-ROW(D$12),0))","v":""},{"$f":"IF($A133<>\"Serviço\",0,ROUND(SUMIF($F$9:$P$9,\"<>\",$F133:$P133),15-13*PO!$X$3))","v":0},{"$f":"OFFSET(PO!$P$12,ROW($E133)-ROW(F$12),0)","v":0}]
[{"$f":"OFFSET(PO!J$12,ROW(A134)-ROW($A$12),0)","v":"Serviço"},{"$f":"IF($A134=0,\"\",OFFSET(PO!K$12,ROW(B134)-ROW(B$12),0))","v":"9.0.1."},{"$f":"IF(OFFSET(PO!N$12,ROW(C134)-ROW(C$12),0)=0,\"\",OFFSET(PO!N$12,ROW(C134)-ROW(C$12),0))","v":"CHAPISCO APLICADO EM ALVENARIAS E ESTRUTURAS DE CONCRETO INTERNAS, COM COLHER DE PEDREIRO.  ARGAMASSA TRAÇO 1:3 COM PREPARO MANUAL. AF_06/2014"},{"$f":"IF(OFFSET(PO!O$12,ROW(D134)-ROW(D$12),0)=0,\"\",OFFSET(PO!O$12,ROW(D134)-ROW(D$12),0))","v":"M2"},{"$f":"IF($A134<>\"Serviço\",0,ROUND(SUMIF($F$9:$P$9,\"<>\",$F134:$P134),15-13*PO!$X$3))","v":569.03},{"$f":"OFFSET(PO!$P$12,ROW($E134)-ROW(F$12),0)","v":569.03}]
[{"$f":"OFFSET(PO!J$12,ROW(A135)-ROW($A$12),0)","v":"Serviço"},{"$f":"IF($A135=0,\"\",OFFSET(PO!K$12,ROW(B135)-ROW(B$12),0))","v":"9.0.2."},{"$f":"IF(OFFSET(PO!N$12,ROW(C135)-ROW(C$12),0)=0,\"\",OFFSET(PO!N$12,ROW(C135)-ROW(C$12),0))","v":"CHAPISCO APLICADO EM ALVENARIA (COM PRESENÇA DE VÃOS) E ESTRUTURAS DE CONCRETO DE FACHADA, COM COLHER DE PEDREIRO.  ARGAMASSA TRAÇO 1:3 COM PREPARO MANUAL. AF_06/2014"},{"$f":"IF(OFFSET(PO!O$12,ROW(D135)-ROW(D$12),0)=0,\"\",OFFSET(PO!O$12,ROW(D135)-ROW(D$12),0))","v":"M2"},{"$f":"IF($A135<>\"Serviço\",0,ROUND(SUMIF($F$9:$P$9,\"<>\",$F135:$P135),15-13*PO!$X$3))","v":303.8},{"$f":"OFFSET(PO!$P$12,ROW($E135)-ROW(F$12),0)","v":303.8}]
[{"$f":"OFFSET(PO!J$12,ROW(A136)-ROW($A$12),0)","v":"Serviço"},{"$f":"IF($A136=0,\"\",OFFSET(PO!K$12,ROW(B136)-ROW(B$12),0))","v":"9.0.3."},{"$f":"IF(OFFSET(PO!N$12,ROW(C136)-ROW(C$12),0)=0,\"\",OFFSET(PO!N$12,ROW(C136)-ROW(C$12),0))","v":"EMBOÇO, PARA RECEBIMENTO DE CERÂMICA, EM ARGAMASSA TRAÇO 1:2:8, PREPARO MECÂNICO COM BETONEIRA 400L, APLICADO MANUALMENTE EM FACES INTERNAS DE PAREDES, PARA AMBIENTE COM ÁREA ENTRE 5M2 E 10M2, ESPESSURA DE 10MM, COM EXECUÇÃO DE TALISCAS. AF_06/2014"},{"$f":"IF(OFFSET(PO!O$12,ROW(D136)-ROW(D$12),0)=0,\"\",OFFSET(PO!O$12,ROW(D136)-ROW(D$12),0))","v":"M2"},{"$f":"IF($A136<>\"Serviço\",0,ROUND(SUMIF($F$9:$P$9,\"<>\",$F136:$P136),15-13*PO!$X$3))","v":110.83},{"$f":"OFFSET(PO!$P$12,ROW($E136)-ROW(F$12),0)","v":110.83}]
[{"$f":"OFFSET(PO!J$12,ROW(A137)-ROW($A$12),0)","v":"Serviço"},{"$f":"IF($A137=0,\"\",OFFSET(PO!K$12,ROW(B137)-ROW(B$12),0))","v":"9.0.4."},{"$f":"IF(OFFSET(PO!N$12,ROW(C137)-ROW(C$12),0)=0,\"\",OFFSET(PO!N$12,ROW(C137)-ROW(C$12),0))","v":"MASSA ÚNICA, PARA RECEBIMENTO DE PINTURA, EM ARGAMASSA TRAÇO 1:2:8, PREPARO MECÂNICO COM BETONEIRA 400L, APLICADA MANUALMENTE EM FACES INTERNAS DE PAREDES, ESPESSURA DE 10MM, COM EXECUÇÃO DE TALISCAS. AF_06/2014"},{"$f":"IF(OFFSET(PO!O$12,ROW(D137)-ROW(D$12),0)=0,\"\",OFFSET(PO!O$12,ROW(D137)-ROW(D$12),0))","v":"M2"},{"$f":"IF($A137<>\"Serviço\",0,ROUND(SUMIF($F$9:$P$9,\"<>\",$F137:$P137),15-13*PO!$X$3))","v":458.2},{"$f":"OFFSET(PO!$P$12,ROW($E137)-ROW(F$12),0)","v":458.2}]
[{"$f":"OFFSET(PO!J$12,ROW(A138)-ROW($A$12),0)","v":"Serviço"},{"$f":"IF($A138=0,\"\",OFFSET(PO!K$12,ROW(B138)-ROW(B$12),0))","v":"9.0.5."},{"$f":"IF(OFFSET(PO!N$12,ROW(C138)-ROW(C$12),0)=0,\"\",OFFSET(PO!N$12,ROW(C138)-ROW(C$12),0))","v":"EMBOÇO OU MASSA ÚNICA EM ARGAMASSA TRAÇO 1:2:8, PREPARO MANUAL, APLICADA MANUALMENTE EM PANOS DE FACHADA COM PRESENÇA DE VÃOS, ESPESSURA DE 15 MM"},{"$f":"IF(OFFSET(PO!O$12,ROW(D138)-ROW(D$12),0)=0,\"\",OFFSET(PO!O$12,ROW(D138)-ROW(D$12),0))","v":"M2"},{"$f":"IF($A138<>\"Serviço\",0,ROUND(SUMIF($F$9:$P$9,\"<>\",$F138:$P138),15-13*PO!$X$3))","v":303.8},{"$f":"OFFSET(PO!$P$12,ROW($E138)-ROW(F$12),0)","v":303.8}]
[{"$f":"OFFSET(PO!J$12,ROW(A139)-ROW($A$12),0)","v":"Serviço"},{"$f":"IF($A139=0,\"\",OFFSET(PO!K$12,ROW(B139)-ROW(B$12),0))","v":"9.0.6."},{"$f":"IF(OFFSET(PO!N$12,ROW(C139)-ROW(C$12),0)=0,\"\",OFFSET(PO!N$12,ROW(C139)-ROW(C$12),0))","v":"MASSA ÚNICA, PARA RECEBIMENTO DE PINTURA OU CERÂMICA, ARGAMASSA INDUSTRIALIZADA, PREPARO MECÂNICO, APLICADO COM EQUIPAMENTO DE MISTURA E PROJEÇÃO DE 1,5 M3/H EM FACES INTERNAS DE PAREDES, ESPESSURA DE 5MM, SEM EXECUÇÃO DE TALISCAS. AF_06/2014"},{"$f":"IF(OFFSET(PO!O$12,ROW(D139)-ROW(D$12),0)=0,\"\",OFFSET(PO!O$12,ROW(D139)-ROW(D$12),0))","v":"M2"},{"$f":"IF($A139<>\"Serviço\",0,ROUND(SUMIF($F$9:$P$9,\"<>\",$F139:$P139),15-13*PO!$X$3))","v":242.44},{"$f":"OFFSET(PO!$P$12,ROW($E139)-ROW(F$12),0)","v":242.44}]
[{"$f":"OFFSET(PO!J$12,ROW(A140)-ROW($A$12),0)","v":"Serviço"},{"$f":"IF($A140=0,\"\",OFFSET(PO!K$12,ROW(B140)-ROW(B$12),0))","v":"9.0.7."},{"$f":"IF(OFFSET(PO!N$12,ROW(C140)-ROW(C$12),0)=0,\"\",OFFSET(PO!N$12,ROW(C140)-ROW(C$12),0))","v":"REVESTIMENTO CERÂMICO PARA PAREDES INTERNAS COM PLACAS TIPO ESMALTADA EXTRA  DE DIMENSÕES 30X40 CM APLICADAS EM AMBIENTES DE ÁREA MENOR QUE 5 M² NA ALTURA INTEIRA DAS PAREDES"},{"$f":"IF(OFFSET(PO!O$12,ROW(D140)-ROW(D$12),0)=0,\"\",OFFSET(PO!O$12,ROW(D140)-ROW(D$12),0))","v":"M2"},{"$f":"IF($A140<>\"Serviço\",0,ROUND(SUMIF($F$9:$P$9,\"<>\",$F140:$P140),15-13*PO!$X$3))","v":110.83},{"$f":"OFFSET(PO!$P$12,ROW($E140)-ROW(F$12),0)","v":110.83}]
[{"$f":"OFFSET(PO!J$12,ROW(A141)-ROW($A$12),0)","v":"Meta"},{"$f":"IF($A141=0,\"\",OFFSET(PO!K$12,ROW(B141)-ROW(B$12),0))","v":"10."},{"$f":"IF(OFFSET(PO!N$12,ROW(C141)-ROW(C$12),0)=0,\"\",OFFSET(PO!N$12,ROW(C141)-ROW(C$12),0))","v":"PISOS"},{"$f":"IF(OFFSET(PO!O$12,ROW(D141)-ROW(D$12),0)=0,\"\",OFFSET(PO!O$12,ROW(D141)-ROW(D$12),0))","v":""},{"$f":"IF($A141<>\"Serviço\",0,ROUND(SUMIF($F$9:$P$9,\"<>\",$F141:$P141),15-13*PO!$X$3))","v":0},{"$f":"OFFSET(PO!$P$12,ROW($E141)-ROW(F$12),0)","v":0}]
[{"$f":"OFFSET(PO!J$12,ROW(A142)-ROW($A$12),0)","v":"Nível 2"},{"$f":"IF($A142=0,\"\",OFFSET(PO!K$12,ROW(B142)-ROW(B$12),0))","v":"10.1."},{"$f":"IF(OFFSET(PO!N$12,ROW(C142)-ROW(C$12),0)=0,\"\",OFFSET(PO!N$12,ROW(C142)-ROW(C$12),0))","v":"PAVIMENTAÇÃO INTERNA"},{"$f":"IF(OFFSET(PO!O$12,ROW(D142)-ROW(D$12),0)=0,\"\",OFFSET(PO!O$12,ROW(D142)-ROW(D$12),0))","v":""},{"$f":"IF($A142<>\"Serviço\",0,ROUND(SUMIF($F$9:$P$9,\"<>\",$F142:$P142),15-13*PO!$X$3))","v":0},{"$f":"OFFSET(PO!$P$12,ROW($E142)-ROW(F$12),0)","v":0}]
[{"$f":"OFFSET(PO!J$12,ROW(A143)-ROW($A$12),0)","v":"Serviço"},{"$f":"IF($A143=0,\"\",OFFSET(PO!K$12,ROW(B143)-ROW(B$12),0))","v":"10.1.1."},{"$f":"IF(OFFSET(PO!N$12,ROW(C143)-ROW(C$12),0)=0,\"\",OFFSET(PO!N$12,ROW(C143)-ROW(C$12),0))","v":"CONCRETAGEM DE LAJE SOBRE SOLO, FCK 25 MPA, ESPESSURA DE 7 CM, INCLUSO TELA SOLDADA NERVURADA Q-92 E BASE DE BRITA (5 CM) - LANÇAMENTO, ADENSAMENTO E ACABAMENTO"},{"$f":"IF(OFFSET(PO!O$12,ROW(D143)-ROW(D$12),0)=0,\"\",OFFSET(PO!O$12,ROW(D143)-ROW(D$12),0))","v":"M2"},{"$f":"IF($A143<>\"Serviço\",0,ROUND(SUMIF($F$9:$P$9,\"<>\",$F143:$P143),15-13*PO!$X$3))","v":150},{"$f":"OFFSET(PO!$P$12,ROW($E143)-ROW(F$12),0)","v":150}]
[{"$f":"OFFSET(PO!J$12,ROW(A144)-ROW($A$12),0)","v":"Serviço"},{"$f":"IF($A144=0,\"\",OFFSET(PO!K$12,ROW(B144)-ROW(B$12),0))","v":"10.1.2."},{"$f":"IF(OFFSET(PO!N$12,ROW(C144)-ROW(C$12),0)=0,\"\",OFFSET(PO!N$12,ROW(C144)-ROW(C$12),0))","v":"FORNECIMENTO/INSTALACAO LONA PLASTICA PRETA, PARA IMPERMEABILIZACAO, ESPESSURA 150 MICRAS."},{"$f":"IF(OFFSET(PO!O$12,ROW(D144)-ROW(D$12),0)=0,\"\",OFFSET(PO!O$12,ROW(D144)-ROW(D$12),0))","v":"M2"},{"$f":"IF($A144<>\"Serviço\",0,ROUND(SUMIF($F$9:$P$9,\"<>\",$F144:$P144),15-13*PO!$X$3))","v":148.30000000000001},{"$f":"OFFSET(PO!$P$12,ROW($E144)-ROW(F$12),0)","v":148.30000000000001}]
[{"$f":"OFFSET(PO!J$12,ROW(A145)-ROW($A$12),0)","v":"Serviço"},{"$f":"IF($A145=0,\"\",OFFSET(PO!K$12,ROW(B145)-ROW(B$12),0))","v":"10.1.3."},{"$f":"IF(OFFSET(PO!N$12,ROW(C145)-ROW(C$12),0)=0,\"\",OFFSET(PO!N$12,ROW(C145)-ROW(C$12),0))","v":"CONTRAPISO EM ARGAMASSA TRAÇO 1:4 (CIMENTO E AREIA), PREPARO MANUAL, APLICADO EM ÁREAS SECAS SOBRE LAJE, ADERIDO, ESPESSURA 2CM. AF_06/2014"},{"$f":"IF(OFFSET(PO!O$12,ROW(D145)-ROW(D$12),0)=0,\"\",OFFSET(PO!O$12,ROW(D145)-ROW(D$12),0))","v":"M2"},{"$f":"IF($A145<>\"Serviço\",0,ROUND(SUMIF($F$9:$P$9,\"<>\",$F145:$P145),15-13*PO!$X$3))","v":148.30000000000001},{"$f":"OFFSET(PO!$P$12,ROW($E145)-ROW(F$12),0)","v":148.30000000000001}]
[{"$f":"OFFSET(PO!J$12,ROW(A146)-ROW($A$12),0)","v":"Serviço"},{"$f":"IF($A146=0,\"\",OFFSET(PO!K$12,ROW(B146)-ROW(B$12),0))","v":"10.1.4."},{"$f":"IF(OFFSET(PO!N$12,ROW(C146)-ROW(C$12),0)=0,\"\",OFFSET(PO!N$12,ROW(C146)-ROW(C$12),0))","v":"REVESTIMENTO CERÂMICO PARA PISO COM PLACAS TIPO ESMALTADA EXTRA DE DIMENSÕES 45X45 CM APLICADA EM AMBIENTES DE ÁREA MAIOR QUE 10 M2. AF_06/2014"},{"$f":"IF(OFFSET(PO!O$12,ROW(D146)-ROW(D$12),0)=0,\"\",OFFSET(PO!O$12,ROW(D146)-ROW(D$12),0))","v":"M2"},{"$f":"IF($A146<>\"Serviço\",0,ROUND(SUMIF($F$9:$P$9,\"<>\",$F146:$P146),15-13*PO!$X$3))","v":146.82},{"$f":"OFFSET(PO!$P$12,ROW($E146)-ROW(F$12),0)","v":146.82}]
[{"$f":"OFFSET(PO!J$12,ROW(A147)-ROW($A$12),0)","v":"Serviço"},{"$f":"IF($A147=0,\"\",OFFSET(PO!K$12,ROW(B147)-ROW(B$12),0))","v":"10.1.5."},{"$f":"IF(OFFSET(PO!N$12,ROW(C147)-ROW(C$12),0)=0,\"\",OFFSET(PO!N$12,ROW(C147)-ROW(C$12),0))","v":"PISO PODOTÁTIL INTERNO EM BORRACHA 25x25cm, E = 5 mm, ASSENTAMENTO COM COLA VINIL (FORNECIMENTO E ASSENTAMENTO)"},{"$f":"IF(OFFSET(PO!O$12,ROW(D147)-ROW(D$12),0)=0,\"\",OFFSET(PO!O$12,ROW(D147)-ROW(D$12),0))","v":"M2"},{"$f":"IF($A147<>\"Serviço\",0,ROUND(SUMIF($F$9:$P$9,\"<>\",$F147:$P147),15-13*PO!$X$3))","v":5.93},{"$f":"OFFSET(PO!$P$12,ROW($E147)-ROW(F$12),0)","v":5.93}]
[{"$f":"OFFSET(PO!J$12,ROW(A148)-ROW($A$12),0)","v":"Meta"},{"$f":"IF($A148=0,\"\",OFFSET(PO!K$12,ROW(B148)-ROW(B$12),0))","v":"11."},{"$f":"IF(OFFSET(PO!N$12,ROW(C148)-ROW(C$12),0)=0,\"\",OFFSET(PO!N$12,ROW(C148)-ROW(C$12),0))","v":"PAVIMENTAÇÃO EXTERNA"},{"$f":"IF(OFFSET(PO!O$12,ROW(D148)-ROW(D$12),0)=0,\"\",OFFSET(PO!O$12,ROW(D148)-ROW(D$12),0))","v":""},{"$f":"IF($A148<>\"Serviço\",0,ROUND(SUMIF($F$9:$P$9,\"<>\",$F148:$P148),15-13*PO!$X$3))","v":0},{"$f":"OFFSET(PO!$P$12,ROW($E148)-ROW(F$12),0)","v":0}]
[{"$f":"OFFSET(PO!J$12,ROW(A149)-ROW($A$12),0)","v":"Serviço"},{"$f":"IF($A149=0,\"\",OFFSET(PO!K$12,ROW(B149)-ROW(B$12),0))","v":"11.0.1."},{"$f":"IF(OFFSET(PO!N$12,ROW(C149)-ROW(C$12),0)=0,\"\",OFFSET(PO!N$12,ROW(C149)-ROW(C$12),0))","v":"EXECUÇÃO DE PÁTIO/ESTACIONAMENTO EM PISO INTERTRAVADO, COM BLOCO RETANGULAR COR NATURAL DE 20 X 10 CM, ESPESSURA 8 CM. AF_12/2015"},{"$f":"IF(OFFSET(PO!O$12,ROW(D149)-ROW(D$12),0)=0,\"\",OFFSET(PO!O$12,ROW(D149)-ROW(D$12),0))","v":"M2"},{"$f":"IF($A149<>\"Serviço\",0,ROUND(SUMIF($F$9:$P$9,\"<>\",$F149:$P149),15-13*PO!$X$3))","v":222.97},{"$f":"OFFSET(PO!$P$12,ROW($E149)-ROW(F$12),0)","v":222.97}]
[{"$f":"OFFSET(PO!J$12,ROW(A150)-ROW($A$12),0)","v":"Serviço"},{"$f":"IF($A150=0,\"\",OFFSET(PO!K$12,ROW(B150)-ROW(B$12),0))","v":"11.0.2."},{"$f":"IF(OFFSET(PO!N$12,ROW(C150)-ROW(C$12),0)=0,\"\",OFFSET(PO!N$12,ROW(C150)-ROW(C$12),0))","v":"ASSENTAMENTO DE GUIA (MEIO-FIO) EM TRECHO CURVO, CONFECCIONADA EM CONCRETO PRÉ-FABRICADO, DIMENSÕES 100X15X13X20 CM (COMPRIMENTO X BASE INFERIOR X BASE SUPERIOR X ALTURA), PARA URBANIZAÇÃO INTERNA DE EMPREENDIMENTOS. AF_06/2016_P"},{"$f":"IF(OFFSET(PO!O$12,ROW(D150)-ROW(D$12),0)=0,\"\",OFFSET(PO!O$12,ROW(D150)-ROW(D$12),0))","v":"M"},{"$f":"IF($A150<>\"Serviço\",0,ROUND(SUMIF($F$9:$P$9,\"<>\",$F150:$P150),15-13*PO!$X$3))","v":63.24},{"$f":"OFFSET(PO!$P$12,ROW($E150)-ROW(F$12),0)","v":63.24}]
[{"$f":"OFFSET(PO!J$12,ROW(A151)-ROW($A$12),0)","v":"Serviço"},{"$f":"IF($A151=0,\"\",OFFSET(PO!K$12,ROW(B151)-ROW(B$12),0))","v":"11.0.3."},{"$f":"IF(OFFSET(PO!N$12,ROW(C151)-ROW(C$12),0)=0,\"\",OFFSET(PO!N$12,ROW(C151)-ROW(C$12),0))","v":"PISO PODOTÁTIL DE ALERTA/DIRECIONAL, 25 X 25 CM, ESPESSURA 25MM, ASSENTADO COM ARGAMASSA TRACO 1:3 (CIMENTO E AREIA)"},{"$f":"IF(OFFSET(PO!O$12,ROW(D151)-ROW(D$12),0)=0,\"\",OFFSET(PO!O$12,ROW(D151)-ROW(D$12),0))","v":"M²"},{"$f":"IF($A151<>\"Serviço\",0,ROUND(SUMIF($F$9:$P$9,\"<>\",$F151:$P151),15-13*PO!$X$3))","v":12.41},{"$f":"OFFSET(PO!$P$12,ROW($E151)-ROW(F$12),0)","v":12.41}]
[{"$f":"OFFSET(PO!J$12,ROW(A152)-ROW($A$12),0)","v":"Serviço"},{"$f":"IF($A152=0,\"\",OFFSET(PO!K$12,ROW(B152)-ROW(B$12),0))","v":"11.0.4."},{"$f":"IF(OFFSET(PO!N$12,ROW(C152)-ROW(C$12),0)=0,\"\",OFFSET(PO!N$12,ROW(C152)-ROW(C$12),0))","v":"PISO PODOTÁTIL DE ALERTA, 40 X 40 CM, ESPESSURA 25MM, ASSENTADO COM ARGAMASSA TRACO 1:3 (CIMENTO E AREIA)"},{"$f":"IF(OFFSET(PO!O$12,ROW(D152)-ROW(D$12),0)=0,\"\",OFFSET(PO!O$12,ROW(D152)-ROW(D$12),0))","v":"M²"},{"$f":"IF($A152<>\"Serviço\",0,ROUND(SUMIF($F$9:$P$9,\"<>\",$F152:$P152),15-13*PO!$X$3))","v":0.64},{"$f":"OFFSET(PO!$P$12,ROW($E152)-ROW(F$12),0)","v":0.64}]
[{"$f":"OFFSET(PO!J$12,ROW(A153)-ROW($A$12),0)","v":"Serviço"},{"$f":"IF($A153=0,\"\",OFFSET(PO!K$12,ROW(B153)-ROW(B$12),0))","v":"11.0.5."},{"$f":"IF(OFFSET(PO!N$12,ROW(C153)-ROW(C$12),0)=0,\"\",OFFSET(PO!N$12,ROW(C153)-ROW(C$12),0))","v":"PLANTIO DE GRAMA EM PLACAS. AF_05/2018"},{"$f":"IF(OFFSET(PO!O$12,ROW(D153)-ROW(D$12),0)=0,\"\",OFFSET(PO!O$12,ROW(D153)-ROW(D$12),0))","v":"M2"},{"$f":"IF($A153<>\"Serviço\",0,ROUND(SUMIF($F$9:$P$9,\"<>\",$F153:$P153),15-13*PO!$X$3))","v":65.34},{"$f":"OFFSET(PO!$P$12,ROW($E153)-ROW(F$12),0)","v":65.34}]
[{"$f":"OFFSET(PO!J$12,ROW(A154)-ROW($A$12),0)","v":"Serviço"},{"$f":"IF($A154=0,\"\",OFFSET(PO!K$12,ROW(B154)-ROW(B$12),0))","v":"11.0.6."},{"$f":"IF(OFFSET(PO!N$12,ROW(C154)-ROW(C$12),0)=0,\"\",OFFSET(PO!N$12,ROW(C154)-ROW(C$12),0))","v":"EXECUÇÃO DE PASSEIO (CALÇADA) OU PISO DE CONCRETO COM CONCRETO MOLDADO IN LOCO, USINADO, ACABAMENTO CONVENCIONAL, ESPESSURA 6 CM, ARMADO. AF_07/2016"},{"$f":"IF(OFFSET(PO!O$12,ROW(D154)-ROW(D$12),0)=0,\"\",OFFSET(PO!O$12,ROW(D154)-ROW(D$12),0))","v":"M2"},{"$f":"IF($A154<>\"Serviço\",0,ROUND(SUMIF($F$9:$P$9,\"<>\",$F154:$P154),15-13*PO!$X$3))","v":10.96},{"$f":"OFFSET(PO!$P$12,ROW($E154)-ROW(F$12),0)","v":10.96}]
[{"$f":"OFFSET(PO!J$12,ROW(A155)-ROW($A$12),0)","v":"Meta"},{"$f":"IF($A155=0,\"\",OFFSET(PO!K$12,ROW(B155)-ROW(B$12),0))","v":"12."},{"$f":"IF(OFFSET(PO!N$12,ROW(C155)-ROW(C$12),0)=0,\"\",OFFSET(PO!N$12,ROW(C155)-ROW(C$12),0))","v":"RODAPÉS, PEITORIS E SOLEIRAS"},{"$f":"IF(OFFSET(PO!O$12,ROW(D155)-ROW(D$12),0)=0,\"\",OFFSET(PO!O$12,ROW(D155)-ROW(D$12),0))","v":""},{"$f":"IF($A155<>\"Serviço\",0,ROUND(SUMIF($F$9:$P$9,\"<>\",$F155:$P155),15-13*PO!$X$3))","v":0},{"$f":"OFFSET(PO!$P$12,ROW($E155)-ROW(F$12),0)","v":0}]
[{"$f":"OFFSET(PO!J$12,ROW(A156)-ROW($A$12),0)","v":"Serviço"},{"$f":"IF($A156=0,\"\",OFFSET(PO!K$12,ROW(B156)-ROW(B$12),0))","v":"12.0.1."},{"$f":"IF(OFFSET(PO!N$12,ROW(C156)-ROW(C$12),0)=0,\"\",OFFSET(PO!N$12,ROW(C156)-ROW(C$12),0))","v":"PEITORIL DE GRANITO CINZA ANDORINHA L= 19 cm E=2CM, ASSENTADO COM ARGAMASSA TRACO 1:3 (CIMENTO E AREIA MEDIA), COM PINGADEIRA"},{"$f":"IF(OFFSET(PO!O$12,ROW(D156)-ROW(D$12),0)=0,\"\",OFFSET(PO!O$12,ROW(D156)-ROW(D$12),0))","v":"M"},{"$f":"IF($A156<>\"Serviço\",0,ROUND(SUMIF($F$9:$P$9,\"<>\",$F156:$P156),15-13*PO!$X$3))","v":21.45},{"$f":"OFFSET(PO!$P$12,ROW($E156)-ROW(F$12),0)","v":21.45}]
[{"$f":"OFFSET(PO!J$12,ROW(A157)-ROW($A$12),0)","v":"Serviço"},{"$f":"IF($A157=0,\"\",OFFSET(PO!K$12,ROW(B157)-ROW(B$12),0))","v":"12.0.2."},{"$f":"IF(OFFSET(PO!N$12,ROW(C157)-ROW(C$12),0)=0,\"\",OFFSET(PO!N$12,ROW(C157)-ROW(C$12),0))","v":" SOLEIRA DE GRANITO CINZA ANDORINHA L= 15cm E=2CM, ASSENTADA SOBRE ARGAMASSA TRACO 1:4 (CIMENTO E AREIA)"},{"$f":"IF(OFFSET(PO!O$12,ROW(D157)-ROW(D$12),0)=0,\"\",OFFSET(PO!O$12,ROW(D157)-ROW(D$12),0))","v":"M"},{"$f":"IF($A157<>\"Serviço\",0,ROUND(SUMIF($F$9:$P$9,\"<>\",$F157:$P157),15-13*PO!$X$3))","v":9.9},{"$f":"OFFSET(PO!$P$12,ROW($E157)-ROW(F$12),0)","v":9.9}]
[{"$f":"OFFSET(PO!J$12,ROW(A158)-ROW($A$12),0)","v":"Serviço"},{"$f":"IF($A158=0,\"\",OFFSET(PO!K$12,ROW(B158)-ROW(B$12),0))","v":"12.0.3."},{"$f":"IF(OFFSET(PO!N$12,ROW(C158)-ROW(C$12),0)=0,\"\",OFFSET(PO!N$12,ROW(C158)-ROW(C$12),0))","v":"RODAPÉ CERÂMICO DE 7CM DE ALTURA COM PLACAS TIPO ESMALTADA EXTRA  DE DIMENSÕES 35X35CM. AF_06/2014"},{"$f":"IF(OFFSET(PO!O$12,ROW(D158)-ROW(D$12),0)=0,\"\",OFFSET(PO!O$12,ROW(D158)-ROW(D$12),0))","v":"M"},{"$f":"IF($A158<>\"Serviço\",0,ROUND(SUMIF($F$9:$P$9,\"<>\",$F158:$P158),15-13*PO!$X$3))","v":101.85},{"$f":"OFFSET(PO!$P$12,ROW($E158)-ROW(F$12),0)","v":101.85}]
[{"$f":"OFFSET(PO!J$12,ROW(A159)-ROW($A$12),0)","v":"Meta"},{"$f":"IF($A159=0,\"\",OFFSET(PO!K$12,ROW(B159)-ROW(B$12),0))","v":"13."},{"$f":"IF(OFFSET(PO!N$12,ROW(C159)-ROW(C$12),0)=0,\"\",OFFSET(PO!N$12,ROW(C159)-ROW(C$12),0))","v":"PINTURA"},{"$f":"IF(OFFSET(PO!O$12,ROW(D159)-ROW(D$12),0)=0,\"\",OFFSET(PO!O$12,ROW(D159)-ROW(D$12),0))","v":""},{"$f":"IF($A159<>\"Serviço\",0,ROUND(SUMIF($F$9:$P$9,\"<>\",$F159:$P159),15-13*PO!$X$3))","v":0},{"$f":"OFFSET(PO!$P$12,ROW($E159)-ROW(F$12),0)","v":0}]
[{"$f":"OFFSET(PO!J$12,ROW(A160)-ROW($A$12),0)","v":"Serviço"},{"$f":"IF($A160=0,\"\",OFFSET(PO!K$12,ROW(B160)-ROW(B$12),0))","v":"13.0.1."},{"$f":"IF(OFFSET(PO!N$12,ROW(C160)-ROW(C$12),0)=0,\"\",OFFSET(PO!N$12,ROW(C160)-ROW(C$12),0))","v":"APLICAÇÃO MANUAL DE MASSA ACRÍLICA EM PAREDES INTERNAS E TETOS, DUAS DEMÃOS"},{"$f":"IF(OFFSET(PO!O$12,ROW(D160)-ROW(D$12),0)=0,\"\",OFFSET(PO!O$12,ROW(D160)-ROW(D$12),0))","v":"M2"},{"$f":"IF($A160<>\"Serviço\",0,ROUND(SUMIF($F$9:$P$9,\"<>\",$F160:$P160),15-13*PO!$X$3))","v":426.49},{"$f":"OFFSET(PO!$P$12,ROW($E160)-ROW(F$12),0)","v":426.49}]
[{"$f":"OFFSET(PO!J$12,ROW(A161)-ROW($A$12),0)","v":"Serviço"},{"$f":"IF($A161=0,\"\",OFFSET(PO!K$12,ROW(B161)-ROW(B$12),0))","v":"13.0.2."},{"$f":"IF(OFFSET(PO!N$12,ROW(C161)-ROW(C$12),0)=0,\"\",OFFSET(PO!N$12,ROW(C161)-ROW(C$12),0))","v":"APLICAÇÃO MANUAL DE PINTURA COM TINTA LÁTEX ACRÍLICA EM PAREDES, DUAS DEMÃOS. AF_06/2014"},{"$f":"IF(OFFSET(PO!O$12,ROW(D161)-ROW(D$12),0)=0,\"\",OFFSET(PO!O$12,ROW(D161)-ROW(D$12),0))","v":"M2"},{"$f":"IF($A161<>\"Serviço\",0,ROUND(SUMIF($F$9:$P$9,\"<>\",$F161:$P161),15-13*PO!$X$3))","v":278.22000000000003},{"$f":"OFFSET(PO!$P$12,ROW($E161)-ROW(F$12),0)","v":278.22000000000003}]
[{"$f":"OFFSET(PO!J$12,ROW(A162)-ROW($A$12),0)","v":"Serviço"},{"$f":"IF($A162=0,\"\",OFFSET(PO!K$12,ROW(B162)-ROW(B$12),0))","v":"13.0.3."},{"$f":"IF(OFFSET(PO!N$12,ROW(C162)-ROW(C$12),0)=0,\"\",OFFSET(PO!N$12,ROW(C162)-ROW(C$12),0))","v":"APLICAÇÃO MANUAL DE PINTURA COM TINTA LÁTEX ACRÍLICA EM TETO, DUAS DEMÃOS. AF_06/2014"},{"$f":"IF(OFFSET(PO!O$12,ROW(D162)-ROW(D$12),0)=0,\"\",OFFSET(PO!O$12,ROW(D162)-ROW(D$12),0))","v":"M2"},{"$f":"IF($A162<>\"Serviço\",0,ROUND(SUMIF($F$9:$P$9,\"<>\",$F162:$P162),15-13*PO!$X$3))","v":148.27000000000001},{"$f":"OFFSET(PO!$P$12,ROW($E162)-ROW(F$12),0)","v":148.27000000000001}]
[{"$f":"OFFSET(PO!J$12,ROW(A163)-ROW($A$12),0)","v":"Serviço"},{"$f":"IF($A163=0,\"\",OFFSET(PO!K$12,ROW(B163)-ROW(B$12),0))","v":"13.0.4."},{"$f":"IF(OFFSET(PO!N$12,ROW(C163)-ROW(C$12),0)=0,\"\",OFFSET(PO!N$12,ROW(C163)-ROW(C$12),0))","v":"APLICAÇÃO DE FUNDO SELADOR ACRÍLICO EM PAREDES, UMA DEMÃO. AF_06/2014"},{"$f":"IF(OFFSET(PO!O$12,ROW(D163)-ROW(D$12),0)=0,\"\",OFFSET(PO!O$12,ROW(D163)-ROW(D$12),0))","v":"M2"},{"$f":"IF($A163<>\"Serviço\",0,ROUND(SUMIF($F$9:$P$9,\"<>\",$F163:$P163),15-13*PO!$X$3))","v":242.44},{"$f":"OFFSET(PO!$P$12,ROW($E163)-ROW(F$12),0)","v":242.44}]
[{"$f":"OFFSET(PO!J$12,ROW(A164)-ROW($A$12),0)","v":"Serviço"},{"$f":"IF($A164=0,\"\",OFFSET(PO!K$12,ROW(B164)-ROW(B$12),0))","v":"13.0.5."},{"$f":"IF(OFFSET(PO!N$12,ROW(C164)-ROW(C$12),0)=0,\"\",OFFSET(PO!N$12,ROW(C164)-ROW(C$12),0))","v":"APLICAÇÃO MANUAL DE PINTURA COM TINTA LÁTEX ACRÍLICA EM PAREDES, DUAS DEMÃOS. AF_06/2014"},{"$f":"IF(OFFSET(PO!O$12,ROW(D164)-ROW(D$12),0)=0,\"\",OFFSET(PO!O$12,ROW(D164)-ROW(D$12),0))","v":"M2"},{"$f":"IF($A164<>\"Serviço\",0,ROUND(SUMIF($F$9:$P$9,\"<>\",$F164:$P164),15-13*PO!$X$3))","v":242.44},{"$f":"OFFSET(PO!$P$12,ROW($E164)-ROW(F$12),0)","v":242.44}]
[{"$f":"OFFSET(PO!J$12,ROW(A165)-ROW($A$12),0)","v":"Serviço"},{"$f":"IF($A165=0,\"\",OFFSET(PO!K$12,ROW(B165)-ROW(B$12),0))","v":"13.0.6."},{"$f":"IF(OFFSET(PO!N$12,ROW(C165)-ROW(C$12),0)=0,\"\",OFFSET(PO!N$12,ROW(C165)-ROW(C$12),0))","v":"FUNDO SINTETICO NIVELADOR BRANCO"},{"$f":"IF(OFFSET(PO!O$12,ROW(D165)-ROW(D$12),0)=0,\"\",OFFSET(PO!O$12,ROW(D165)-ROW(D$12),0))","v":"M2"},{"$f":"IF($A165<>\"Serviço\",0,ROUND(SUMIF($F$9:$P$9,\"<>\",$F165:$P165),15-13*PO!$X$3))","v":53.55},{"$f":"OFFSET(PO!$P$12,ROW($E165)-ROW(F$12),0)","v":53.55}]
[{"$f":"OFFSET(PO!J$12,ROW(A166)-ROW($A$12),0)","v":"Serviço"},{"$f":"IF($A166=0,\"\",OFFSET(PO!K$12,ROW(B166)-ROW(B$12),0))","v":"13.0.7."},{"$f":"IF(OFFSET(PO!N$12,ROW(C166)-ROW(C$12),0)=0,\"\",OFFSET(PO!N$12,ROW(C166)-ROW(C$12),0))","v":"PINTURA ESMALTE ACETINADO PARA MADEIRA, DUAS DEMAOS, SOBRE FUNDO NIVELADOR BRANCO"},{"$f":"IF(OFFSET(PO!O$12,ROW(D166)-ROW(D$12),0)=0,\"\",OFFSET(PO!O$12,ROW(D166)-ROW(D$12),0))","v":"M2"},{"$f":"IF($A166<>\"Serviço\",0,ROUND(SUMIF($F$9:$P$9,\"<>\",$F166:$P166),15-13*PO!$X$3))","v":53.55},{"$f":"OFFSET(PO!$P$12,ROW($E166)-ROW(F$12),0)","v":53.55}]
[{"$f":"OFFSET(PO!J$12,ROW(A167)-ROW($A$12),0)","v":"Meta"},{"$f":"IF($A167=0,\"\",OFFSET(PO!K$12,ROW(B167)-ROW(B$12),0))","v":"14."},{"$f":"IF(OFFSET(PO!N$12,ROW(C167)-ROW(C$12),0)=0,\"\",OFFSET(PO!N$12,ROW(C167)-ROW(C$12),0))","v":"INSTALAÇÃO HIDRÁULICA"},{"$f":"IF(OFFSET(PO!O$12,ROW(D167)-ROW(D$12),0)=0,\"\",OFFSET(PO!O$12,ROW(D167)-ROW(D$12),0))","v":""},{"$f":"IF($A167<>\"Serviço\",0,ROUND(SUMIF($F$9:$P$9,\"<>\",$F167:$P167),15-13*PO!$X$3))","v":0},{"$f":"OFFSET(PO!$P$12,ROW($E167)-ROW(F$12),0)","v":0}]
[{"$f":"OFFSET(PO!J$12,ROW(A168)-ROW($A$12),0)","v":"Nível 2"},{"$f":"IF($A168=0,\"\",OFFSET(PO!K$12,ROW(B168)-ROW(B$12),0))","v":"14.1."},{"$f":"IF(OFFSET(PO!N$12,ROW(C168)-ROW(C$12),0)=0,\"\",OFFSET(PO!N$12,ROW(C168)-ROW(C$12),0))","v":"TUBULAÇÕES E CONEXÕES"},{"$f":"IF(OFFSET(PO!O$12,ROW(D168)-ROW(D$12),0)=0,\"\",OFFSET(PO!O$12,ROW(D168)-ROW(D$12),0))","v":""},{"$f":"IF($A168<>\"Serviço\",0,ROUND(SUMIF($F$9:$P$9,\"<>\",$F168:$P168),15-13*PO!$X$3))","v":0},{"$f":"OFFSET(PO!$P$12,ROW($E168)-ROW(F$12),0)","v":0}]
[{"$f":"OFFSET(PO!J$12,ROW(A169)-ROW($A$12),0)","v":"Serviço"},{"$f":"IF($A169=0,\"\",OFFSET(PO!K$12,ROW(B169)-ROW(B$12),0))","v":"14.1.1."},{"$f":"IF(OFFSET(PO!N$12,ROW(C169)-ROW(C$12),0)=0,\"\",OFFSET(PO!N$12,ROW(C169)-ROW(C$12),0))","v":"TUBO, PVC, SOLDÁVEL, DN 25MM, INSTALADO EM RAMAL DE DISTRIBUIÇÃO DE ÁGUA - FORNECIMENTO E INSTALAÇÃO. AF_12/2014"},{"$f":"IF(OFFSET(PO!O$12,ROW(D169)-ROW(D$12),0)=0,\"\",OFFSET(PO!O$12,ROW(D169)-ROW(D$12),0))","v":"M"},{"$f":"IF($A169<>\"Serviço\",0,ROUND(SUMIF($F$9:$P$9,\"<>\",$F169:$P169),15-13*PO!$X$3))","v":37.5},{"$f":"OFFSET(PO!$P$12,ROW($E169)-ROW(F$12),0)","v":37.5}]
[{"$f":"OFFSET(PO!J$12,ROW(A170)-ROW($A$12),0)","v":"Serviço"},{"$f":"IF($A170=0,\"\",OFFSET(PO!K$12,ROW(B170)-ROW(B$12),0))","v":"14.1.2."},{"$f":"IF(OFFSET(PO!N$12,ROW(C170)-ROW(C$12),0)=0,\"\",OFFSET(PO!N$12,ROW(C170)-ROW(C$12),0))","v":"TUBO, PVC, SOLDÁVEL, DN 32MM, INSTALADO EM RAMAL DE DISTRIBUIÇÃO DE ÁGUA - FORNECIMENTO E INSTALAÇÃO. AF_12/2014"},{"$f":"IF(OFFSET(PO!O$12,ROW(D170)-ROW(D$12),0)=0,\"\",OFFSET(PO!O$12,ROW(D170)-ROW(D$12),0))","v":"M"},{"$f":"IF($A170<>\"Serviço\",0,ROUND(SUMIF($F$9:$P$9,\"<>\",$F170:$P170),15-13*PO!$X$3))","v":8.15},{"$f":"OFFSET(PO!$P$12,ROW($E170)-ROW(F$12),0)","v":8.15}]
[{"$f":"OFFSET(PO!J$12,ROW(A171)-ROW($A$12),0)","v":"Serviço"},{"$f":"IF($A171=0,\"\",OFFSET(PO!K$12,ROW(B171)-ROW(B$12),0))","v":"14.1.3."},{"$f":"IF(OFFSET(PO!N$12,ROW(C171)-ROW(C$12),0)=0,\"\",OFFSET(PO!N$12,ROW(C171)-ROW(C$12),0))","v":"TUBO, PVC, SOLDÁVEL, DN 40MM, INSTALADO EM PRUMADA DE ÁGUA - FORNECIMENTO E INSTALAÇÃO. AF_12/2014"},{"$f":"IF(OFFSET(PO!O$12,ROW(D171)-ROW(D$12),0)=0,\"\",OFFSET(PO!O$12,ROW(D171)-ROW(D$12),0))","v":"M"},{"$f":"IF($A171<>\"Serviço\",0,ROUND(SUMIF($F$9:$P$9,\"<>\",$F171:$P171),15-13*PO!$X$3))","v":11.9},{"$f":"OFFSET(PO!$P$12,ROW($E171)-ROW(F$12),0)","v":11.9}]
[{"$f":"OFFSET(PO!J$12,ROW(A172)-ROW($A$12),0)","v":"Serviço"},{"$f":"IF($A172=0,\"\",OFFSET(PO!K$12,ROW(B172)-ROW(B$12),0))","v":"14.1.4."},{"$f":"IF(OFFSET(PO!N$12,ROW(C172)-ROW(C$12),0)=0,\"\",OFFSET(PO!N$12,ROW(C172)-ROW(C$12),0))","v":"BUCHA DE REDUCAO DE PVC, SOLDAVEL, CURTA, COM 32 X 25 MM, PARA AGUA FRIA PREDIAL"},{"$f":"IF(OFFSET(PO!O$12,ROW(D172)-ROW(D$12),0)=0,\"\",OFFSET(PO!O$12,ROW(D172)-ROW(D$12),0))","v":"UN"},{"$f":"IF($A172<>\"Serviço\",0,ROUND(SUMIF($F$9:$P$9,\"<>\",$F172:$P172),15-13*PO!$X$3))","v":2},{"$f":"OFFSET(PO!$P$12,ROW($E172)-ROW(F$12),0)","v":2}]
[{"$f":"OFFSET(PO!J$12,ROW(A173)-ROW($A$12),0)","v":"Serviço"},{"$f":"IF($A173=0,\"\",OFFSET(PO!K$12,ROW(B173)-ROW(B$12),0))","v":"14.1.5."},{"$f":"IF(OFFSET(PO!N$12,ROW(C173)-ROW(C$12),0)=0,\"\",OFFSET(PO!N$12,ROW(C173)-ROW(C$12),0))","v":"BUCHA DE REDUÇÃO, PVC, SOLDÁVEL, DN 40MM X 32MM, INSTALADO EM RAMAL OU SUB-RAMAL DE ÁGUA - FORNECIMENTO E INSTALAÇÃO. AF_03/2015"},{"$f":"IF(OFFSET(PO!O$12,ROW(D173)-ROW(D$12),0)=0,\"\",OFFSET(PO!O$12,ROW(D173)-ROW(D$12),0))","v":"UN"},{"$f":"IF($A173<>\"Serviço\",0,ROUND(SUMIF($F$9:$P$9,\"<>\",$F173:$P173),15-13*PO!$X$3))","v":1},{"$f":"OFFSET(PO!$P$12,ROW($E173)-ROW(F$12),0)","v":1}]
[{"$f":"OFFSET(PO!J$12,ROW(A174)-ROW($A$12),0)","v":"Serviço"},{"$f":"IF($A174=0,\"\",OFFSET(PO!K$12,ROW(B174)-ROW(B$12),0))","v":"14.1.6."},{"$f":"IF(OFFSET(PO!N$12,ROW(C174)-ROW(C$12),0)=0,\"\",OFFSET(PO!N$12,ROW(C174)-ROW(C$12),0))","v":"BUCHA DE REDUCAO DE PVC, SOLDAVEL, LONGA, COM 40 X 25 MM, PARA AGUA FRIA PREDIAL"},{"$f":"IF(OFFSET(PO!O$12,ROW(D174)-ROW(D$12),0)=0,\"\",OFFSET(PO!O$12,ROW(D174)-ROW(D$12),0))","v":"UN"},{"$f":"IF($A174<>\"Serviço\",0,ROUND(SUMIF($F$9:$P$9,\"<>\",$F174:$P174),15-13*PO!$X$3))","v":1},{"$f":"OFFSET(PO!$P$12,ROW($E174)-ROW(F$12),0)","v":1}]
[{"$f":"OFFSET(PO!J$12,ROW(A175)-ROW($A$12),0)","v":"Serviço"},{"$f":"IF($A175=0,\"\",OFFSET(PO!K$12,ROW(B175)-ROW(B$12),0))","v":"14.1.7."},{"$f":"IF(OFFSET(PO!N$12,ROW(C175)-ROW(C$12),0)=0,\"\",OFFSET(PO!N$12,ROW(C175)-ROW(C$12),0))","v":"JOELHO 90 GRAUS, PVC, SOLDÁVEL, DN 25MM, INSTALADO EM RAMAL OU SUB-RAMAL DE ÁGUA - FORNECIMENTO E INSTALAÇÃO. AF_12/2014"},{"$f":"IF(OFFSET(PO!O$12,ROW(D175)-ROW(D$12),0)=0,\"\",OFFSET(PO!O$12,ROW(D175)-ROW(D$12),0))","v":"UN"},{"$f":"IF($A175<>\"Serviço\",0,ROUND(SUMIF($F$9:$P$9,\"<>\",$F175:$P175),15-13*PO!$X$3))","v":15},{"$f":"OFFSET(PO!$P$12,ROW($E175)-ROW(F$12),0)","v":15}]
[{"$f":"OFFSET(PO!J$12,ROW(A176)-ROW($A$12),0)","v":"Serviço"},{"$f":"IF($A176=0,\"\",OFFSET(PO!K$12,ROW(B176)-ROW(B$12),0))","v":"14.1.8."},{"$f":"IF(OFFSET(PO!N$12,ROW(C176)-ROW(C$12),0)=0,\"\",OFFSET(PO!N$12,ROW(C176)-ROW(C$12),0))","v":"JOELHO 90 GRAUS, PVC, SOLDÁVEL, DN 32MM, INSTALADO EM RAMAL OU SUB-RAMAL DE ÁGUA - FORNECIMENTO E INSTALAÇÃO. AF_12/2014"},{"$f":"IF(OFFSET(PO!O$12,ROW(D176)-ROW(D$12),0)=0,\"\",OFFSET(PO!O$12,ROW(D176)-ROW(D$12),0))","v":"UN"},{"$f":"IF($A176<>\"Serviço\",0,ROUND(SUMIF($F$9:$P$9,\"<>\",$F176:$P176),15-13*PO!$X$3))","v":7},{"$f":"OFFSET(PO!$P$12,ROW($E176)-ROW(F$12),0)","v":7}]
[{"$f":"OFFSET(PO!J$12,ROW(A177)-ROW($A$12),0)","v":"Serviço"},{"$f":"IF($A177=0,\"\",OFFSET(PO!K$12,ROW(B177)-ROW(B$12),0))","v":"14.1.9."},{"$f":"IF(OFFSET(PO!N$12,ROW(C177)-ROW(C$12),0)=0,\"\",OFFSET(PO!N$12,ROW(C177)-ROW(C$12),0))","v":"JOELHO 90 GRAUS, PVC, SOLDÁVEL, DN 40MM, INSTALADO EM PRUMADA DE ÁGUA - FORNECIMENTO E INSTALAÇÃO. AF_12/2014"},{"$f":"IF(OFFSET(PO!O$12,ROW(D177)-ROW(D$12),0)=0,\"\",OFFSET(PO!O$12,ROW(D177)-ROW(D$12),0))","v":"UN"},{"$f":"IF($A177<>\"Serviço\",0,ROUND(SUMIF($F$9:$P$9,\"<>\",$F177:$P177),15-13*PO!$X$3))","v":3},{"$f":"OFFSET(PO!$P$12,ROW($E177)-ROW(F$12),0)","v":3}]
[{"$f":"OFFSET(PO!J$12,ROW(A178)-ROW($A$12),0)","v":"Serviço"},{"$f":"IF($A178=0,\"\",OFFSET(PO!K$12,ROW(B178)-ROW(B$12),0))","v":"14.1.10."},{"$f":"IF(OFFSET(PO!N$12,ROW(C178)-ROW(C$12),0)=0,\"\",OFFSET(PO!N$12,ROW(C178)-ROW(C$12),0))","v":"JOELHO 45 GRAUS, PVC, SOLDÁVEL, DN 25MM, INSTALADO EM RAMAL OU SUB-RAMAL DE ÁGUA - FORNECIMENTO E INSTALAÇÃO. AF_12/2014"},{"$f":"IF(OFFSET(PO!O$12,ROW(D178)-ROW(D$12),0)=0,\"\",OFFSET(PO!O$12,ROW(D178)-ROW(D$12),0))","v":"UN"},{"$f":"IF($A178<>\"Serviço\",0,ROUND(SUMIF($F$9:$P$9,\"<>\",$F178:$P178),15-13*PO!$X$3))","v":2},{"$f":"OFFSET(PO!$P$12,ROW($E178)-ROW(F$12),0)","v":2}]
[{"$f":"OFFSET(PO!J$12,ROW(A179)-ROW($A$12),0)","v":"Serviço"},{"$f":"IF($A179=0,\"\",OFFSET(PO!K$12,ROW(B179)-ROW(B$12),0))","v":"14.1.11."},{"$f":"IF(OFFSET(PO!N$12,ROW(C179)-ROW(C$12),0)=0,\"\",OFFSET(PO!N$12,ROW(C179)-ROW(C$12),0))","v":"JOELHO DE REDUCAO, PVC SOLDAVEL, 90 GRAUS,  32 MM X 25 MM, PARA AGUA FRIA PREDIAL"},{"$f":"IF(OFFSET(PO!O$12,ROW(D179)-ROW(D$12),0)=0,\"\",OFFSET(PO!O$12,ROW(D179)-ROW(D$12),0))","v":"UN"},{"$f":"IF($A179<>\"Serviço\",0,ROUND(SUMIF($F$9:$P$9,\"<>\",$F179:$P179),15-13*PO!$X$3))","v":1},{"$f":"OFFSET(PO!$P$12,ROW($E179)-ROW(F$12),0)","v":1}]
[{"$f":"OFFSET(PO!J$12,ROW(A180)-ROW($A$12),0)","v":"Serviço"},{"$f":"IF($A180=0,\"\",OFFSET(PO!K$12,ROW(B180)-ROW(B$12),0))","v":"14.1.12."},{"$f":"IF(OFFSET(PO!N$12,ROW(C180)-ROW(C$12),0)=0,\"\",OFFSET(PO!N$12,ROW(C180)-ROW(C$12),0))","v":"TE, PVC, SOLDÁVEL, DN 25MM, INSTALADO EM RAMAL OU SUB-RAMAL DE ÁGUA - FORNECIMENTO E INSTALAÇÃO. AF_12/2014"},{"$f":"IF(OFFSET(PO!O$12,ROW(D180)-ROW(D$12),0)=0,\"\",OFFSET(PO!O$12,ROW(D180)-ROW(D$12),0))","v":"UN"},{"$f":"IF($A180<>\"Serviço\",0,ROUND(SUMIF($F$9:$P$9,\"<>\",$F180:$P180),15-13*PO!$X$3))","v":7},{"$f":"OFFSET(PO!$P$12,ROW($E180)-ROW(F$12),0)","v":7}]
[{"$f":"OFFSET(PO!J$12,ROW(A181)-ROW($A$12),0)","v":"Serviço"},{"$f":"IF($A181=0,\"\",OFFSET(PO!K$12,ROW(B181)-ROW(B$12),0))","v":"14.1.13."},{"$f":"IF(OFFSET(PO!N$12,ROW(C181)-ROW(C$12),0)=0,\"\",OFFSET(PO!N$12,ROW(C181)-ROW(C$12),0))","v":"TE, PVC, SOLDÁVEL, DN 32MM, INSTALADO EM RAMAL OU SUB-RAMAL DE ÁGUA - FORNECIMENTO E INSTALAÇÃO. AF_12/2014"},{"$f":"IF(OFFSET(PO!O$12,ROW(D181)-ROW(D$12),0)=0,\"\",OFFSET(PO!O$12,ROW(D181)-ROW(D$12),0))","v":"UN"},{"$f":"IF($A181<>\"Serviço\",0,ROUND(SUMIF($F$9:$P$9,\"<>\",$F181:$P181),15-13*PO!$X$3))","v":4},{"$f":"OFFSET(PO!$P$12,ROW($E181)-ROW(F$12),0)","v":4}]
[{"$f":"OFFSET(PO!J$12,ROW(A182)-ROW($A$12),0)","v":"Serviço"},{"$f":"IF($A182=0,\"\",OFFSET(PO!K$12,ROW(B182)-ROW(B$12),0))","v":"14.1.14."},{"$f":"IF(OFFSET(PO!N$12,ROW(C182)-ROW(C$12),0)=0,\"\",OFFSET(PO!N$12,ROW(C182)-ROW(C$12),0))","v":"TE, PVC, SOLDÁVEL, DN 40MM, INSTALADO EM PRUMADA DE ÁGUA - FORNECIMENTO E INSTALAÇÃO. AF_12/2014"},{"$f":"IF(OFFSET(PO!O$12,ROW(D182)-ROW(D$12),0)=0,\"\",OFFSET(PO!O$12,ROW(D182)-ROW(D$12),0))","v":"UN"},{"$f":"IF($A182<>\"Serviço\",0,ROUND(SUMIF($F$9:$P$9,\"<>\",$F182:$P182),15-13*PO!$X$3))","v":2},{"$f":"OFFSET(PO!$P$12,ROW($E182)-ROW(F$12),0)","v":2}]
[{"$f":"OFFSET(PO!J$12,ROW(A183)-ROW($A$12),0)","v":"Serviço"},{"$f":"IF($A183=0,\"\",OFFSET(PO!K$12,ROW(B183)-ROW(B$12),0))","v":"14.1.15."},{"$f":"IF(OFFSET(PO!N$12,ROW(C183)-ROW(C$12),0)=0,\"\",OFFSET(PO!N$12,ROW(C183)-ROW(C$12),0))","v":"TE DE REDUCAO, PVC, SOLDAVEL, 90 GRAUS, 40 MM X 32 MM, PARA AGUA FRIA PREDIAL"},{"$f":"IF(OFFSET(PO!O$12,ROW(D183)-ROW(D$12),0)=0,\"\",OFFSET(PO!O$12,ROW(D183)-ROW(D$12),0))","v":"UN"},{"$f":"IF($A183<>\"Serviço\",0,ROUND(SUMIF($F$9:$P$9,\"<>\",$F183:$P183),15-13*PO!$X$3))","v":1},{"$f":"OFFSET(PO!$P$12,ROW($E183)-ROW(F$12),0)","v":1}]
[{"$f":"OFFSET(PO!J$12,ROW(A184)-ROW($A$12),0)","v":"Serviço"},{"$f":"IF($A184=0,\"\",OFFSET(PO!K$12,ROW(B184)-ROW(B$12),0))","v":"14.1.16."},{"$f":"IF(OFFSET(PO!N$12,ROW(C184)-ROW(C$12),0)=0,\"\",OFFSET(PO!N$12,ROW(C184)-ROW(C$12),0))","v":"LUVA, PVC, SOLDÁVEL, DN 25MM, INSTALADO EM RAMAL OU SUB-RAMAL DE ÁGUA - FORNECIMENTO E INSTALAÇÃO. AF_12/2014"},{"$f":"IF(OFFSET(PO!O$12,ROW(D184)-ROW(D$12),0)=0,\"\",OFFSET(PO!O$12,ROW(D184)-ROW(D$12),0))","v":"UN"},{"$f":"IF($A184<>\"Serviço\",0,ROUND(SUMIF($F$9:$P$9,\"<>\",$F184:$P184),15-13*PO!$X$3))","v":3},{"$f":"OFFSET(PO!$P$12,ROW($E184)-ROW(F$12),0)","v":3}]
[{"$f":"OFFSET(PO!J$12,ROW(A185)-ROW($A$12),0)","v":"Nível 2"},{"$f":"IF($A185=0,\"\",OFFSET(PO!K$12,ROW(B185)-ROW(B$12),0))","v":"14.2."},{"$f":"IF(OFFSET(PO!N$12,ROW(C185)-ROW(C$12),0)=0,\"\",OFFSET(PO!N$12,ROW(C185)-ROW(C$12),0))","v":"ACESSÓRIOS E COMPLEMENTOS"},{"$f":"IF(OFFSET(PO!O$12,ROW(D185)-ROW(D$12),0)=0,\"\",OFFSET(PO!O$12,ROW(D185)-ROW(D$12),0))","v":""},{"$f":"IF($A185<>\"Serviço\",0,ROUND(SUMIF($F$9:$P$9,\"<>\",$F185:$P185),15-13*PO!$X$3))","v":0},{"$f":"OFFSET(PO!$P$12,ROW($E185)-ROW(F$12),0)","v":0}]
[{"$f":"OFFSET(PO!J$12,ROW(A186)-ROW($A$12),0)","v":"Serviço"},{"$f":"IF($A186=0,\"\",OFFSET(PO!K$12,ROW(B186)-ROW(B$12),0))","v":"14.2.1."},{"$f":"IF(OFFSET(PO!N$12,ROW(C186)-ROW(C$12),0)=0,\"\",OFFSET(PO!N$12,ROW(C186)-ROW(C$12),0))","v":"ADAPTADOR COM FLANGE E ANEL DE VEDAÇÃO, PVC, SOLDÁVEL, DN  25 MM X 3/4 , INSTALADO EM RESERVAÇÃO DE ÁGUA DE EDIFICAÇÃO QUE POSSUA RESERVATÓRIO DE FIBRA/FIBROCIMENTO   FORNECIMENTO E INSTALAÇÃO. AF_06/2016"},{"$f":"IF(OFFSET(PO!O$12,ROW(D186)-ROW(D$12),0)=0,\"\",OFFSET(PO!O$12,ROW(D186)-ROW(D$12),0))","v":"UN"},{"$f":"IF($A186<>\"Serviço\",0,ROUND(SUMIF($F$9:$P$9,\"<>\",$F186:$P186),15-13*PO!$X$3))","v":2},{"$f":"OFFSET(PO!$P$12,ROW($E186)-ROW(F$12),0)","v":2}]
[{"$f":"OFFSET(PO!J$12,ROW(A187)-ROW($A$12),0)","v":"Serviço"},{"$f":"IF($A187=0,\"\",OFFSET(PO!K$12,ROW(B187)-ROW(B$12),0))","v":"14.2.2."},{"$f":"IF(OFFSET(PO!N$12,ROW(C187)-ROW(C$12),0)=0,\"\",OFFSET(PO!N$12,ROW(C187)-ROW(C$12),0))","v":"ADAPTADOR COM FLANGE E ANEL DE VEDAÇÃO, PVC, SOLDÁVEL, DN 32 MM X 1 , INSTALADO EM RESERVAÇÃO DE ÁGUA DE EDIFICAÇÃO QUE POSSUA RESERVATÓRIO DE FIBRA/FIBROCIMENTO   FORNECIMENTO E INSTALAÇÃO. AF_06/2016"},{"$f":"IF(OFFSET(PO!O$12,ROW(D187)-ROW(D$12),0)=0,\"\",OFFSET(PO!O$12,ROW(D187)-ROW(D$12),0))","v":"UN"},{"$f":"IF($A187<>\"Serviço\",0,ROUND(SUMIF($F$9:$P$9,\"<>\",$F187:$P187),15-13*PO!$X$3))","v":4},{"$f":"OFFSET(PO!$P$12,ROW($E187)-ROW(F$12),0)","v":4}]
[{"$f":"OFFSET(PO!J$12,ROW(A188)-ROW($A$12),0)","v":"Serviço"},{"$f":"IF($A188=0,\"\",OFFSET(PO!K$12,ROW(B188)-ROW(B$12),0))","v":"14.2.3."},{"$f":"IF(OFFSET(PO!N$12,ROW(C188)-ROW(C$12),0)=0,\"\",OFFSET(PO!N$12,ROW(C188)-ROW(C$12),0))","v":"ADAPTADOR COM FLANGE E ANEL DE VEDAÇÃO, PVC, SOLDÁVEL, DN 40 MM X 1 1/4 , INSTALADO EM RESERVAÇÃO DE ÁGUA DE EDIFICAÇÃO QUE POSSUA RESERVATÓRIO DE FIBRA/FIBROCIMENTO   FORNECIMENTO E INSTALAÇÃO. AF_06/2016"},{"$f":"IF(OFFSET(PO!O$12,ROW(D188)-ROW(D$12),0)=0,\"\",OFFSET(PO!O$12,ROW(D188)-ROW(D$12),0))","v":"UN"},{"$f":"IF($A188<>\"Serviço\",0,ROUND(SUMIF($F$9:$P$9,\"<>\",$F188:$P188),15-13*PO!$X$3))","v":2},{"$f":"OFFSET(PO!$P$12,ROW($E188)-ROW(F$12),0)","v":2}]
[{"$f":"OFFSET(PO!J$12,ROW(A189)-ROW($A$12),0)","v":"Serviço"},{"$f":"IF($A189=0,\"\",OFFSET(PO!K$12,ROW(B189)-ROW(B$12),0))","v":"14.2.4."},{"$f":"IF(OFFSET(PO!N$12,ROW(C189)-ROW(C$12),0)=0,\"\",OFFSET(PO!N$12,ROW(C189)-ROW(C$12),0))","v":"ADAPTADOR CURTO COM BOLSA E ROSCA PARA REGISTRO, PVC, SOLDÁVEL, DN  25 MM X 3/4 , INSTALADO EM RESERVAÇÃO DE ÁGUA DE EDIFICAÇÃO QUE POSSUA RESERVATÓRIO DE FIBRA/FIBROCIMENTO   FORNECIMENTO E INSTALAÇÃO. AF_06/2016"},{"$f":"IF(OFFSET(PO!O$12,ROW(D189)-ROW(D$12),0)=0,\"\",OFFSET(PO!O$12,ROW(D189)-ROW(D$12),0))","v":"UN"},{"$f":"IF($A189<>\"Serviço\",0,ROUND(SUMIF($F$9:$P$9,\"<>\",$F189:$P189),15-13*PO!$X$3))","v":10},{"$f":"OFFSET(PO!$P$12,ROW($E189)-ROW(F$12),0)","v":10}]
[{"$f":"OFFSET(PO!J$12,ROW(A190)-ROW($A$12),0)","v":"Serviço"},{"$f":"IF($A190=0,\"\",OFFSET(PO!K$12,ROW(B190)-ROW(B$12),0))","v":"14.2.5."},{"$f":"IF(OFFSET(PO!N$12,ROW(C190)-ROW(C$12),0)=0,\"\",OFFSET(PO!N$12,ROW(C190)-ROW(C$12),0))","v":"TORNEIRA DE BÓIA REAL, ROSCÁVEL, 3/4\", FORNECIDA E INSTALADA EM RESERVAÇÃO DE ÁGUA. AF_06/2016"},{"$f":"IF(OFFSET(PO!O$12,ROW(D190)-ROW(D$12),0)=0,\"\",OFFSET(PO!O$12,ROW(D190)-ROW(D$12),0))","v":"UN"},{"$f":"IF($A190<>\"Serviço\",0,ROUND(SUMIF($F$9:$P$9,\"<>\",$F190:$P190),15-13*PO!$X$3))","v":2},{"$f":"OFFSET(PO!$P$12,ROW($E190)-ROW(F$12),0)","v":2}]
[{"$f":"OFFSET(PO!J$12,ROW(A191)-ROW($A$12),0)","v":"Serviço"},{"$f":"IF($A191=0,\"\",OFFSET(PO!K$12,ROW(B191)-ROW(B$12),0))","v":"14.2.6."},{"$f":"IF(OFFSET(PO!N$12,ROW(C191)-ROW(C$12),0)=0,\"\",OFFSET(PO!N$12,ROW(C191)-ROW(C$12),0))","v":"JOELHO 90 GRAUS COM BUCHA DE LATÃO, PVC, SOLDÁVEL, DN 25MM, X 1/2\u0094 INSTALADO EM RAMAL OU SUB-RAMAL DE ÁGUA - FORNECIMENTO E INSTALAÇÃO. AF_12/2014"},{"$f":"IF(OFFSET(PO!O$12,ROW(D191)-ROW(D$12),0)=0,\"\",OFFSET(PO!O$12,ROW(D191)-ROW(D$12),0))","v":"UN"},{"$f":"IF($A191<>\"Serviço\",0,ROUND(SUMIF($F$9:$P$9,\"<>\",$F191:$P191),15-13*PO!$X$3))","v":7},{"$f":"OFFSET(PO!$P$12,ROW($E191)-ROW(F$12),0)","v":7}]
[{"$f":"OFFSET(PO!J$12,ROW(A192)-ROW($A$12),0)","v":"Serviço"},{"$f":"IF($A192=0,\"\",OFFSET(PO!K$12,ROW(B192)-ROW(B$12),0))","v":"14.2.7."},{"$f":"IF(OFFSET(PO!N$12,ROW(C192)-ROW(C$12),0)=0,\"\",OFFSET(PO!N$12,ROW(C192)-ROW(C$12),0))","v":"JOELHO 90 GRAUS COM BUCHA DE LATÃO, PVC, SOLDÁVEL, DN 25MM, X 3/4\u0094 INSTALADO EM RAMAL OU SUB-RAMAL DE ÁGUA - FORNECIMENTO E INSTALAÇÃO. AF_12/2014"},{"$f":"IF(OFFSET(PO!O$12,ROW(D192)-ROW(D$12),0)=0,\"\",OFFSET(PO!O$12,ROW(D192)-ROW(D$12),0))","v":"UN"},{"$f":"IF($A192<>\"Serviço\",0,ROUND(SUMIF($F$9:$P$9,\"<>\",$F192:$P192),15-13*PO!$X$3))","v":3},{"$f":"OFFSET(PO!$P$12,ROW($E192)-ROW(F$12),0)","v":3}]
[{"$f":"OFFSET(PO!J$12,ROW(A193)-ROW($A$12),0)","v":"Serviço"},{"$f":"IF($A193=0,\"\",OFFSET(PO!K$12,ROW(B193)-ROW(B$12),0))","v":"14.2.8."},{"$f":"IF(OFFSET(PO!N$12,ROW(C193)-ROW(C$12),0)=0,\"\",OFFSET(PO!N$12,ROW(C193)-ROW(C$12),0))","v":"CAIXA D'AGUA FIBRA DE VIDRO PARA 1500 LITROS, COM TAMPA"},{"$f":"IF(OFFSET(PO!O$12,ROW(D193)-ROW(D$12),0)=0,\"\",OFFSET(PO!O$12,ROW(D193)-ROW(D$12),0))","v":"UN"},{"$f":"IF($A193<>\"Serviço\",0,ROUND(SUMIF($F$9:$P$9,\"<>\",$F193:$P193),15-13*PO!$X$3))","v":2},{"$f":"OFFSET(PO!$P$12,ROW($E193)-ROW(F$12),0)","v":2}]
[{"$f":"OFFSET(PO!J$12,ROW(A194)-ROW($A$12),0)","v":"Serviço"},{"$f":"IF($A194=0,\"\",OFFSET(PO!K$12,ROW(B194)-ROW(B$12),0))","v":"14.2.9."},{"$f":"IF(OFFSET(PO!N$12,ROW(C194)-ROW(C$12),0)=0,\"\",OFFSET(PO!N$12,ROW(C194)-ROW(C$12),0))","v":"REGISTRO DE ESFERA, PVC, SOLDÁVEL, DN  32 MM, INSTALADO EM RESERVAÇÃO DE ÁGUA DE EDIFICAÇÃO QUE POSSUA RESERVATÓRIO DE FIBRA/FIBROCIMENTO   FORNECIMENTO E INSTALAÇÃO. AF_06/2016"},{"$f":"IF(OFFSET(PO!O$12,ROW(D194)-ROW(D$12),0)=0,\"\",OFFSET(PO!O$12,ROW(D194)-ROW(D$12),0))","v":"UN"},{"$f":"IF($A194<>\"Serviço\",0,ROUND(SUMIF($F$9:$P$9,\"<>\",$F194:$P194),15-13*PO!$X$3))","v":2},{"$f":"OFFSET(PO!$P$12,ROW($E194)-ROW(F$12),0)","v":2}]
[{"$f":"OFFSET(PO!J$12,ROW(A195)-ROW($A$12),0)","v":"Serviço"},{"$f":"IF($A195=0,\"\",OFFSET(PO!K$12,ROW(B195)-ROW(B$12),0))","v":"14.2.10."},{"$f":"IF(OFFSET(PO!N$12,ROW(C195)-ROW(C$12),0)=0,\"\",OFFSET(PO!N$12,ROW(C195)-ROW(C$12),0))","v":"REGISTRO DE ESFERA, PVC, SOLDÁVEL, DN  40 MM, INSTALADO EM RESERVAÇÃO DE ÁGUA DE EDIFICAÇÃO QUE POSSUA RESERVATÓRIO DE FIBRA/FIBROCIMENTO   FORNECIMENTO E INSTALAÇÃO. AF_06/2016"},{"$f":"IF(OFFSET(PO!O$12,ROW(D195)-ROW(D$12),0)=0,\"\",OFFSET(PO!O$12,ROW(D195)-ROW(D$12),0))","v":"UN"},{"$f":"IF($A195<>\"Serviço\",0,ROUND(SUMIF($F$9:$P$9,\"<>\",$F195:$P195),15-13*PO!$X$3))","v":2},{"$f":"OFFSET(PO!$P$12,ROW($E195)-ROW(F$12),0)","v":2}]
[{"$f":"OFFSET(PO!J$12,ROW(A196)-ROW($A$12),0)","v":"Meta"},{"$f":"IF($A196=0,\"\",OFFSET(PO!K$12,ROW(B196)-ROW(B$12),0))","v":"15."},{"$f":"IF(OFFSET(PO!N$12,ROW(C196)-ROW(C$12),0)=0,\"\",OFFSET(PO!N$12,ROW(C196)-ROW(C$12),0))","v":"INSTALAÇÃO SANITÁRIA E DRENAGEM PLUVIAL"},{"$f":"IF(OFFSET(PO!O$12,ROW(D196)-ROW(D$12),0)=0,\"\",OFFSET(PO!O$12,ROW(D196)-ROW(D$12),0))","v":""},{"$f":"IF($A196<>\"Serviço\",0,ROUND(SUMIF($F$9:$P$9,\"<>\",$F196:$P196),15-13*PO!$X$3))","v":0},{"$f":"OFFSET(PO!$P$12,ROW($E196)-ROW(F$12),0)","v":0}]
[{"$f":"OFFSET(PO!J$12,ROW(A197)-ROW($A$12),0)","v":"Nível 2"},{"$f":"IF($A197=0,\"\",OFFSET(PO!K$12,ROW(B197)-ROW(B$12),0))","v":"15.1."},{"$f":"IF(OFFSET(PO!N$12,ROW(C197)-ROW(C$12),0)=0,\"\",OFFSET(PO!N$12,ROW(C197)-ROW(C$12),0))","v":"TUBULAÇÕES E CONEXÕES"},{"$f":"IF(OFFSET(PO!O$12,ROW(D197)-ROW(D$12),0)=0,\"\",OFFSET(PO!O$12,ROW(D197)-ROW(D$12),0))","v":""},{"$f":"IF($A197<>\"Serviço\",0,ROUND(SUMIF($F$9:$P$9,\"<>\",$F197:$P197),15-13*PO!$X$3))","v":0},{"$f":"OFFSET(PO!$P$12,ROW($E197)-ROW(F$12),0)","v":0}]
[{"$f":"OFFSET(PO!J$12,ROW(A198)-ROW($A$12),0)","v":"Serviço"},{"$f":"IF($A198=0,\"\",OFFSET(PO!K$12,ROW(B198)-ROW(B$12),0))","v":"15.1.1."},{"$f":"IF(OFFSET(PO!N$12,ROW(C198)-ROW(C$12),0)=0,\"\",OFFSET(PO!N$12,ROW(C198)-ROW(C$12),0))","v":"TUBO PVC, SERIE NORMAL, ESGOTO PREDIAL, DN 100 MM, FORNECIDO E INSTALADO EM RAMAL DE DESCARGA OU RAMAL DE ESGOTO SANITÁRIO. AF_12/2014"},{"$f":"IF(OFFSET(PO!O$12,ROW(D198)-ROW(D$12),0)=0,\"\",OFFSET(PO!O$12,ROW(D198)-ROW(D$12),0))","v":"M"},{"$f":"IF($A198<>\"Serviço\",0,ROUND(SUMIF($F$9:$P$9,\"<>\",$F198:$P198),15-13*PO!$X$3))","v":69.5},{"$f":"OFFSET(PO!$P$12,ROW($E198)-ROW(F$12),0)","v":69.5}]
[{"$f":"OFFSET(PO!J$12,ROW(A199)-ROW($A$12),0)","v":"Serviço"},{"$f":"IF($A199=0,\"\",OFFSET(PO!K$12,ROW(B199)-ROW(B$12),0))","v":"15.1.2."},{"$f":"IF(OFFSET(PO!N$12,ROW(C199)-ROW(C$12),0)=0,\"\",OFFSET(PO!N$12,ROW(C199)-ROW(C$12),0))","v":"TUBO PVC, SERIE NORMAL, ESGOTO PREDIAL, DN 150 MM, FORNECIDO E INSTALADO EM SUBCOLETOR AÉREO DE ESGOTO SANITÁRIO. AF_12/2014"},{"$f":"IF(OFFSET(PO!O$12,ROW(D199)-ROW(D$12),0)=0,\"\",OFFSET(PO!O$12,ROW(D199)-ROW(D$12),0))","v":"M"},{"$f":"IF($A199<>\"Serviço\",0,ROUND(SUMIF($F$9:$P$9,\"<>\",$F199:$P199),15-13*PO!$X$3))","v":18},{"$f":"OFFSET(PO!$P$12,ROW($E199)-ROW(F$12),0)","v":18}]
[{"$f":"OFFSET(PO!J$12,ROW(A200)-ROW($A$12),0)","v":"Serviço"},{"$f":"IF($A200=0,\"\",OFFSET(PO!K$12,ROW(B200)-ROW(B$12),0))","v":"15.1.3."},{"$f":"IF(OFFSET(PO!N$12,ROW(C200)-ROW(C$12),0)=0,\"\",OFFSET(PO!N$12,ROW(C200)-ROW(C$12),0))","v":"TUBO PVC, SERIE NORMAL, ESGOTO PREDIAL, DN 40 MM, FORNECIDO E INSTALADO EM RAMAL DE DESCARGA OU RAMAL DE ESGOTO SANITÁRIO. AF_12/2014"},{"$f":"IF(OFFSET(PO!O$12,ROW(D200)-ROW(D$12),0)=0,\"\",OFFSET(PO!O$12,ROW(D200)-ROW(D$12),0))","v":"M"},{"$f":"IF($A200<>\"Serviço\",0,ROUND(SUMIF($F$9:$P$9,\"<>\",$F200:$P200),15-13*PO!$X$3))","v":6.7},{"$f":"OFFSET(PO!$P$12,ROW($E200)-ROW(F$12),0)","v":6.7}]
[{"$f":"OFFSET(PO!J$12,ROW(A201)-ROW($A$12),0)","v":"Serviço"},{"$f":"IF($A201=0,\"\",OFFSET(PO!K$12,ROW(B201)-ROW(B$12),0))","v":"15.1.4."},{"$f":"IF(OFFSET(PO!N$12,ROW(C201)-ROW(C$12),0)=0,\"\",OFFSET(PO!N$12,ROW(C201)-ROW(C$12),0))","v":"TUBO PVC, SERIE NORMAL, ESGOTO PREDIAL, DN 50 MM, FORNECIDO E INSTALADO EM RAMAL DE DESCARGA OU RAMAL DE ESGOTO SANITÁRIO. AF_12/2014"},{"$f":"IF(OFFSET(PO!O$12,ROW(D201)-ROW(D$12),0)=0,\"\",OFFSET(PO!O$12,ROW(D201)-ROW(D$12),0))","v":"M"},{"$f":"IF($A201<>\"Serviço\",0,ROUND(SUMIF($F$9:$P$9,\"<>\",$F201:$P201),15-13*PO!$X$3))","v":17.66},{"$f":"OFFSET(PO!$P$12,ROW($E201)-ROW(F$12),0)","v":17.66}]
[{"$f":"OFFSET(PO!J$12,ROW(A202)-ROW($A$12),0)","v":"Serviço"},{"$f":"IF($A202=0,\"\",OFFSET(PO!K$12,ROW(B202)-ROW(B$12),0))","v":"15.1.5."},{"$f":"IF(OFFSET(PO!N$12,ROW(C202)-ROW(C$12),0)=0,\"\",OFFSET(PO!N$12,ROW(C202)-ROW(C$12),0))","v":"TUBO PVC, SÉRIE R, ÁGUA PLUVIAL, DN 75 MM, FORNECIDO E INSTALADO EM RAMAL DE ENCAMINHAMENTO. AF_12/2014"},{"$f":"IF(OFFSET(PO!O$12,ROW(D202)-ROW(D$12),0)=0,\"\",OFFSET(PO!O$12,ROW(D202)-ROW(D$12),0))","v":"M"},{"$f":"IF($A202<>\"Serviço\",0,ROUND(SUMIF($F$9:$P$9,\"<>\",$F202:$P202),15-13*PO!$X$3))","v":46.8},{"$f":"OFFSET(PO!$P$12,ROW($E202)-ROW(F$12),0)","v":46.8}]
[{"$f":"OFFSET(PO!J$12,ROW(A203)-ROW($A$12),0)","v":"Serviço"},{"$f":"IF($A203=0,\"\",OFFSET(PO!K$12,ROW(B203)-ROW(B$12),0))","v":"15.1.6."},{"$f":"IF(OFFSET(PO!N$12,ROW(C203)-ROW(C$12),0)=0,\"\",OFFSET(PO!N$12,ROW(C203)-ROW(C$12),0))","v":"TUBO DE PVC PARA REDE COLETORA DE ESGOTO DE PAREDE MACIÇA, DN 200 MM, JUNTA ELÁSTICA, INSTALADO EM LOCAL COM NÍVEL BAIXO DE INTERFERÊNCIAS - FORNECIMENTO E ASSENTAMENTO. AF_06/2015"},{"$f":"IF(OFFSET(PO!O$12,ROW(D203)-ROW(D$12),0)=0,\"\",OFFSET(PO!O$12,ROW(D203)-ROW(D$12),0))","v":"M"},{"$f":"IF($A203<>\"Serviço\",0,ROUND(SUMIF($F$9:$P$9,\"<>\",$F203:$P203),15-13*PO!$X$3))","v":12.2},{"$f":"OFFSET(PO!$P$12,ROW($E203)-ROW(F$12),0)","v":12.2}]
[{"$f":"OFFSET(PO!J$12,ROW(A204)-ROW($A$12),0)","v":"Serviço"},{"$f":"IF($A204=0,\"\",OFFSET(PO!K$12,ROW(B204)-ROW(B$12),0))","v":"15.1.7."},{"$f":"IF(OFFSET(PO!N$12,ROW(C204)-ROW(C$12),0)=0,\"\",OFFSET(PO!N$12,ROW(C204)-ROW(C$12),0))","v":"TUBO CONCRETO SIMPLES DN 300 MM PARA DRENAGEM - FORNECIMENTO E INSTALACAO INCLUSIVE ESCAVACAO MANUAL 1M3/M"},{"$f":"IF(OFFSET(PO!O$12,ROW(D204)-ROW(D$12),0)=0,\"\",OFFSET(PO!O$12,ROW(D204)-ROW(D$12),0))","v":"M"},{"$f":"IF($A204<>\"Serviço\",0,ROUND(SUMIF($F$9:$P$9,\"<>\",$F204:$P204),15-13*PO!$X$3))","v":12},{"$f":"OFFSET(PO!$P$12,ROW($E204)-ROW(F$12),0)","v":12}]
[{"$f":"OFFSET(PO!J$12,ROW(A205)-ROW($A$12),0)","v":"Serviço"},{"$f":"IF($A205=0,\"\",OFFSET(PO!K$12,ROW(B205)-ROW(B$12),0))","v":"15.1.8."},{"$f":"IF(OFFSET(PO!N$12,ROW(C205)-ROW(C$12),0)=0,\"\",OFFSET(PO!N$12,ROW(C205)-ROW(C$12),0))","v":"CURVA PVC LONGA 45 GRAUS, 100 MM, PARA ESGOTO PREDIAL"},{"$f":"IF(OFFSET(PO!O$12,ROW(D205)-ROW(D$12),0)=0,\"\",OFFSET(PO!O$12,ROW(D205)-ROW(D$12),0))","v":"UN"},{"$f":"IF($A205<>\"Serviço\",0,ROUND(SUMIF($F$9:$P$9,\"<>\",$F205:$P205),15-13*PO!$X$3))","v":2},{"$f":"OFFSET(PO!$P$12,ROW($E205)-ROW(F$12),0)","v":2}]
[{"$f":"OFFSET(PO!J$12,ROW(A206)-ROW($A$12),0)","v":"Serviço"},{"$f":"IF($A206=0,\"\",OFFSET(PO!K$12,ROW(B206)-ROW(B$12),0))","v":"15.1.9."},{"$f":"IF(OFFSET(PO!N$12,ROW(C206)-ROW(C$12),0)=0,\"\",OFFSET(PO!N$12,ROW(C206)-ROW(C$12),0))","v":"CURVA CURTA 90 GRAUS, PVC, SERIE NORMAL, ESGOTO PREDIAL, DN 100 MM, JUNTA ELÁSTICA, FORNECIDO E INSTALADO EM RAMAL DE DESCARGA OU RAMAL DE ESGOTO SANITÁRIO. AF_12/2014"},{"$f":"IF(OFFSET(PO!O$12,ROW(D206)-ROW(D$12),0)=0,\"\",OFFSET(PO!O$12,ROW(D206)-ROW(D$12),0))","v":"UN"},{"$f":"IF($A206<>\"Serviço\",0,ROUND(SUMIF($F$9:$P$9,\"<>\",$F206:$P206),15-13*PO!$X$3))","v":8},{"$f":"OFFSET(PO!$P$12,ROW($E206)-ROW(F$12),0)","v":8}]
[{"$f":"OFFSET(PO!J$12,ROW(A207)-ROW($A$12),0)","v":"Serviço"},{"$f":"IF($A207=0,\"\",OFFSET(PO!K$12,ROW(B207)-ROW(B$12),0))","v":"15.1.10."},{"$f":"IF(OFFSET(PO!N$12,ROW(C207)-ROW(C$12),0)=0,\"\",OFFSET(PO!N$12,ROW(C207)-ROW(C$12),0))","v":"CURVA CURTA 90 GRAUS, PVC, SERIE NORMAL, ESGOTO PREDIAL, DN 40 MM, JUNTA SOLDÁVEL, FORNECIDO E INSTALADO EM RAMAL DE DESCARGA OU RAMAL DE ESGOTO SANITÁRIO. AF_12/2014"},{"$f":"IF(OFFSET(PO!O$12,ROW(D207)-ROW(D$12),0)=0,\"\",OFFSET(PO!O$12,ROW(D207)-ROW(D$12),0))","v":"UN"},{"$f":"IF($A207<>\"Serviço\",0,ROUND(SUMIF($F$9:$P$9,\"<>\",$F207:$P207),15-13*PO!$X$3))","v":7},{"$f":"OFFSET(PO!$P$12,ROW($E207)-ROW(F$12),0)","v":7}]
[{"$f":"OFFSET(PO!J$12,ROW(A208)-ROW($A$12),0)","v":"Serviço"},{"$f":"IF($A208=0,\"\",OFFSET(PO!K$12,ROW(B208)-ROW(B$12),0))","v":"15.1.11."},{"$f":"IF(OFFSET(PO!N$12,ROW(C208)-ROW(C$12),0)=0,\"\",OFFSET(PO!N$12,ROW(C208)-ROW(C$12),0))","v":"CURVA DE PVC, 90 GRAUS, SERIE R, DN 75 MM, PARA ESGOTO PREDIAL"},{"$f":"IF(OFFSET(PO!O$12,ROW(D208)-ROW(D$12),0)=0,\"\",OFFSET(PO!O$12,ROW(D208)-ROW(D$12),0))","v":"UN"},{"$f":"IF($A208<>\"Serviço\",0,ROUND(SUMIF($F$9:$P$9,\"<>\",$F208:$P208),15-13*PO!$X$3))","v":9},{"$f":"OFFSET(PO!$P$12,ROW($E208)-ROW(F$12),0)","v":9}]
[{"$f":"OFFSET(PO!J$12,ROW(A209)-ROW($A$12),0)","v":"Serviço"},{"$f":"IF($A209=0,\"\",OFFSET(PO!K$12,ROW(B209)-ROW(B$12),0))","v":"15.1.12."},{"$f":"IF(OFFSET(PO!N$12,ROW(C209)-ROW(C$12),0)=0,\"\",OFFSET(PO!N$12,ROW(C209)-ROW(C$12),0))","v":"JOELHO 45 GRAUS, PVC, SERIE NORMAL, ESGOTO PREDIAL, DN 100 MM, JUNTA ELÁSTICA, FORNECIDO E INSTALADO EM RAMAL DE DESCARGA OU RAMAL DE ESGOTO SANITÁRIO. AF_12/2014"},{"$f":"IF(OFFSET(PO!O$12,ROW(D209)-ROW(D$12),0)=0,\"\",OFFSET(PO!O$12,ROW(D209)-ROW(D$12),0))","v":"UN"},{"$f":"IF($A209<>\"Serviço\",0,ROUND(SUMIF($F$9:$P$9,\"<>\",$F209:$P209),15-13*PO!$X$3))","v":2},{"$f":"OFFSET(PO!$P$12,ROW($E209)-ROW(F$12),0)","v":2}]
[{"$f":"OFFSET(PO!J$12,ROW(A210)-ROW($A$12),0)","v":"Serviço"},{"$f":"IF($A210=0,\"\",OFFSET(PO!K$12,ROW(B210)-ROW(B$12),0))","v":"15.1.13."},{"$f":"IF(OFFSET(PO!N$12,ROW(C210)-ROW(C$12),0)=0,\"\",OFFSET(PO!N$12,ROW(C210)-ROW(C$12),0))","v":"JOELHO 45 GRAUS, PVC, SERIE NORMAL, ESGOTO PREDIAL, DN 40 MM, JUNTA SOLDÁVEL, FORNECIDO E INSTALADO EM RAMAL DE DESCARGA OU RAMAL DE ESGOTO SANITÁRIO. AF_12/2014"},{"$f":"IF(OFFSET(PO!O$12,ROW(D210)-ROW(D$12),0)=0,\"\",OFFSET(PO!O$12,ROW(D210)-ROW(D$12),0))","v":"UN"},{"$f":"IF($A210<>\"Serviço\",0,ROUND(SUMIF($F$9:$P$9,\"<>\",$F210:$P210),15-13*PO!$X$3))","v":3},{"$f":"OFFSET(PO!$P$12,ROW($E210)-ROW(F$12),0)","v":3}]
[{"$f":"OFFSET(PO!J$12,ROW(A211)-ROW($A$12),0)","v":"Serviço"},{"$f":"IF($A211=0,\"\",OFFSET(PO!K$12,ROW(B211)-ROW(B$12),0))","v":"15.1.14."},{"$f":"IF(OFFSET(PO!N$12,ROW(C211)-ROW(C$12),0)=0,\"\",OFFSET(PO!N$12,ROW(C211)-ROW(C$12),0))","v":"JOELHO 45 GRAUS, PVC, SERIE NORMAL, ESGOTO PREDIAL, DN 50 MM, JUNTA ELÁSTICA, FORNECIDO E INSTALADO EM RAMAL DE DESCARGA OU RAMAL DE ESGOTO SANITÁRIO. AF_12/2014"},{"$f":"IF(OFFSET(PO!O$12,ROW(D211)-ROW(D$12),0)=0,\"\",OFFSET(PO!O$12,ROW(D211)-ROW(D$12),0))","v":"UN"},{"$f":"IF($A211<>\"Serviço\",0,ROUND(SUMIF($F$9:$P$9,\"<>\",$F211:$P211),15-13*PO!$X$3))","v":7},{"$f":"OFFSET(PO!$P$12,ROW($E211)-ROW(F$12),0)","v":7}]
[{"$f":"OFFSET(PO!J$12,ROW(A212)-ROW($A$12),0)","v":"Serviço"},{"$f":"IF($A212=0,\"\",OFFSET(PO!K$12,ROW(B212)-ROW(B$12),0))","v":"15.1.15."},{"$f":"IF(OFFSET(PO!N$12,ROW(C212)-ROW(C$12),0)=0,\"\",OFFSET(PO!N$12,ROW(C212)-ROW(C$12),0))","v":"JOELHO 90 GRAUS, PVC, SERIE NORMAL, ESGOTO PREDIAL, DN 100 MM, JUNTA ELÁSTICA, FORNECIDO E INSTALADO EM RAMAL DE DESCARGA OU RAMAL DE ESGOTO SANITÁRIO. AF_12/2014"},{"$f":"IF(OFFSET(PO!O$12,ROW(D212)-ROW(D$12),0)=0,\"\",OFFSET(PO!O$12,ROW(D212)-ROW(D$12),0))","v":"UN"},{"$f":"IF($A212<>\"Serviço\",0,ROUND(SUMIF($F$9:$P$9,\"<>\",$F212:$P212),15-13*PO!$X$3))","v":4},{"$f":"OFFSET(PO!$P$12,ROW($E212)-ROW(F$12),0)","v":4}]
[{"$f":"OFFSET(PO!J$12,ROW(A213)-ROW($A$12),0)","v":"Serviço"},{"$f":"IF($A213=0,\"\",OFFSET(PO!K$12,ROW(B213)-ROW(B$12),0))","v":"15.1.16."},{"$f":"IF(OFFSET(PO!N$12,ROW(C213)-ROW(C$12),0)=0,\"\",OFFSET(PO!N$12,ROW(C213)-ROW(C$12),0))","v":"JOELHO 90 GRAUS, PVC, SERIE NORMAL, ESGOTO PREDIAL, DN 50 MM, JUNTA ELÁSTICA, FORNECIDO E INSTALADO EM RAMAL DE DESCARGA OU RAMAL DE ESGOTO SANITÁRIO. AF_12/2014"},{"$f":"IF(OFFSET(PO!O$12,ROW(D213)-ROW(D$12),0)=0,\"\",OFFSET(PO!O$12,ROW(D213)-ROW(D$12),0))","v":"UN"},{"$f":"IF($A213<>\"Serviço\",0,ROUND(SUMIF($F$9:$P$9,\"<>\",$F213:$P213),15-13*PO!$X$3))","v":8},{"$f":"OFFSET(PO!$P$12,ROW($E213)-ROW(F$12),0)","v":8}]
[{"$f":"OFFSET(PO!J$12,ROW(A214)-ROW($A$12),0)","v":"Serviço"},{"$f":"IF($A214=0,\"\",OFFSET(PO!K$12,ROW(B214)-ROW(B$12),0))","v":"15.1.17."},{"$f":"IF(OFFSET(PO!N$12,ROW(C214)-ROW(C$12),0)=0,\"\",OFFSET(PO!N$12,ROW(C214)-ROW(C$12),0))","v":"JOELHO 90 GRAUS, PVC, SERIE R, ÁGUA PLUVIAL, DN 75 MM, JUNTA ELÁSTICA, FORNECIDO E INSTALADO EM CONDUTORES VERTICAIS DE ÁGUAS PLUVIAIS. AF_12/2014"},{"$f":"IF(OFFSET(PO!O$12,ROW(D214)-ROW(D$12),0)=0,\"\",OFFSET(PO!O$12,ROW(D214)-ROW(D$12),0))","v":"UN"},{"$f":"IF($A214<>\"Serviço\",0,ROUND(SUMIF($F$9:$P$9,\"<>\",$F214:$P214),15-13*PO!$X$3))","v":9},{"$f":"OFFSET(PO!$P$12,ROW($E214)-ROW(F$12),0)","v":9}]
[{"$f":"OFFSET(PO!J$12,ROW(A215)-ROW($A$12),0)","v":"Serviço"},{"$f":"IF($A215=0,\"\",OFFSET(PO!K$12,ROW(B215)-ROW(B$12),0))","v":"15.1.18."},{"$f":"IF(OFFSET(PO!N$12,ROW(C215)-ROW(C$12),0)=0,\"\",OFFSET(PO!N$12,ROW(C215)-ROW(C$12),0))","v":"JOELHO PVC, COM BOLSA E ANEL, 90 GRAUS, DN 40 X *38* MM, SERIE NORMAL, PARA ESGOTO PREDIAL"},{"$f":"IF(OFFSET(PO!O$12,ROW(D215)-ROW(D$12),0)=0,\"\",OFFSET(PO!O$12,ROW(D215)-ROW(D$12),0))","v":"UN"},{"$f":"IF($A215<>\"Serviço\",0,ROUND(SUMIF($F$9:$P$9,\"<>\",$F215:$P215),15-13*PO!$X$3))","v":7},{"$f":"OFFSET(PO!$P$12,ROW($E215)-ROW(F$12),0)","v":7}]
[{"$f":"OFFSET(PO!J$12,ROW(A216)-ROW($A$12),0)","v":"Serviço"},{"$f":"IF($A216=0,\"\",OFFSET(PO!K$12,ROW(B216)-ROW(B$12),0))","v":"15.1.19."},{"$f":"IF(OFFSET(PO!N$12,ROW(C216)-ROW(C$12),0)=0,\"\",OFFSET(PO!N$12,ROW(C216)-ROW(C$12),0))","v":"JUNCAO SIMPLES, PVC, DN 100 X 50 MM, SERIE NORMAL PARA ESGOTO PREDIAL"},{"$f":"IF(OFFSET(PO!O$12,ROW(D216)-ROW(D$12),0)=0,\"\",OFFSET(PO!O$12,ROW(D216)-ROW(D$12),0))","v":"UN"},{"$f":"IF($A216<>\"Serviço\",0,ROUND(SUMIF($F$9:$P$9,\"<>\",$F216:$P216),15-13*PO!$X$3))","v":4},{"$f":"OFFSET(PO!$P$12,ROW($E216)-ROW(F$12),0)","v":4}]
[{"$f":"OFFSET(PO!J$12,ROW(A217)-ROW($A$12),0)","v":"Serviço"},{"$f":"IF($A217=0,\"\",OFFSET(PO!K$12,ROW(B217)-ROW(B$12),0))","v":"15.1.20."},{"$f":"IF(OFFSET(PO!N$12,ROW(C217)-ROW(C$12),0)=0,\"\",OFFSET(PO!N$12,ROW(C217)-ROW(C$12),0))","v":"JUNÇÃO SIMPLES, PVC, SERIE NORMAL, ESGOTO PREDIAL, DN 100 X 100 MM, JUNTA ELÁSTICA, FORNECIDO E INSTALADO EM RAMAL DE DESCARGA OU RAMAL DE ESGOTO SANITÁRIO. AF_12/2014"},{"$f":"IF(OFFSET(PO!O$12,ROW(D217)-ROW(D$12),0)=0,\"\",OFFSET(PO!O$12,ROW(D217)-ROW(D$12),0))","v":"UN"},{"$f":"IF($A217<>\"Serviço\",0,ROUND(SUMIF($F$9:$P$9,\"<>\",$F217:$P217),15-13*PO!$X$3))","v":1},{"$f":"OFFSET(PO!$P$12,ROW($E217)-ROW(F$12),0)","v":1}]
[{"$f":"OFFSET(PO!J$12,ROW(A218)-ROW($A$12),0)","v":"Serviço"},{"$f":"IF($A218=0,\"\",OFFSET(PO!K$12,ROW(B218)-ROW(B$12),0))","v":"15.1.21."},{"$f":"IF(OFFSET(PO!N$12,ROW(C218)-ROW(C$12),0)=0,\"\",OFFSET(PO!N$12,ROW(C218)-ROW(C$12),0))","v":"JUNÇÃO SIMPLES, PVC, SERIE NORMAL, ESGOTO PREDIAL, DN 50 X 50 MM, JUNTA ELÁSTICA, FORNECIDO E INSTALADO EM RAMAL DE DESCARGA OU RAMAL DE ESGOTO SANITÁRIO. AF_12/2014"},{"$f":"IF(OFFSET(PO!O$12,ROW(D218)-ROW(D$12),0)=0,\"\",OFFSET(PO!O$12,ROW(D218)-ROW(D$12),0))","v":"UN"},{"$f":"IF($A218<>\"Serviço\",0,ROUND(SUMIF($F$9:$P$9,\"<>\",$F218:$P218),15-13*PO!$X$3))","v":1},{"$f":"OFFSET(PO!$P$12,ROW($E218)-ROW(F$12),0)","v":1}]
[{"$f":"OFFSET(PO!J$12,ROW(A219)-ROW($A$12),0)","v":"Serviço"},{"$f":"IF($A219=0,\"\",OFFSET(PO!K$12,ROW(B219)-ROW(B$12),0))","v":"15.1.22."},{"$f":"IF(OFFSET(PO!N$12,ROW(C219)-ROW(C$12),0)=0,\"\",OFFSET(PO!N$12,ROW(C219)-ROW(C$12),0))","v":"TE, PVC, SERIE NORMAL, ESGOTO PREDIAL, DN 50 X 50 MM, JUNTA ELÁSTICA, FORNECIDO E INSTALADO EM PRUMADA DE ESGOTO SANITÁRIO OU VENTILAÇÃO. AF_12/2014"},{"$f":"IF(OFFSET(PO!O$12,ROW(D219)-ROW(D$12),0)=0,\"\",OFFSET(PO!O$12,ROW(D219)-ROW(D$12),0))","v":"UN"},{"$f":"IF($A219<>\"Serviço\",0,ROUND(SUMIF($F$9:$P$9,\"<>\",$F219:$P219),15-13*PO!$X$3))","v":6},{"$f":"OFFSET(PO!$P$12,ROW($E219)-ROW(F$12),0)","v":6}]
[{"$f":"OFFSET(PO!J$12,ROW(A220)-ROW($A$12),0)","v":"Serviço"},{"$f":"IF($A220=0,\"\",OFFSET(PO!K$12,ROW(B220)-ROW(B$12),0))","v":"15.1.23."},{"$f":"IF(OFFSET(PO!N$12,ROW(C220)-ROW(C$12),0)=0,\"\",OFFSET(PO!N$12,ROW(C220)-ROW(C$12),0))","v":"REDUÇÃO EXCÊNTRICA, PVC, SERIE R, ÁGUA PLUVIAL, DN 100 X 75 MM, JUNTA ELÁSTICA, FORNECIDO E INSTALADO EM CONDUTORES VERTICAIS DE ÁGUAS PLUVIAIS. AF_12/2014"},{"$f":"IF(OFFSET(PO!O$12,ROW(D220)-ROW(D$12),0)=0,\"\",OFFSET(PO!O$12,ROW(D220)-ROW(D$12),0))","v":"UN"},{"$f":"IF($A220<>\"Serviço\",0,ROUND(SUMIF($F$9:$P$9,\"<>\",$F220:$P220),15-13*PO!$X$3))","v":6},{"$f":"OFFSET(PO!$P$12,ROW($E220)-ROW(F$12),0)","v":6}]
[{"$f":"OFFSET(PO!J$12,ROW(A221)-ROW($A$12),0)","v":"Nível 2"},{"$f":"IF($A221=0,\"\",OFFSET(PO!K$12,ROW(B221)-ROW(B$12),0))","v":"15.2."},{"$f":"IF(OFFSET(PO!N$12,ROW(C221)-ROW(C$12),0)=0,\"\",OFFSET(PO!N$12,ROW(C221)-ROW(C$12),0))","v":"ACESSÓRIOS E COMPLEMENTOS"},{"$f":"IF(OFFSET(PO!O$12,ROW(D221)-ROW(D$12),0)=0,\"\",OFFSET(PO!O$12,ROW(D221)-ROW(D$12),0))","v":""},{"$f":"IF($A221<>\"Serviço\",0,ROUND(SUMIF($F$9:$P$9,\"<>\",$F221:$P221),15-13*PO!$X$3))","v":0},{"$f":"OFFSET(PO!$P$12,ROW($E221)-ROW(F$12),0)","v":0}]
[{"$f":"OFFSET(PO!J$12,ROW(A222)-ROW($A$12),0)","v":"Serviço"},{"$f":"IF($A222=0,\"\",OFFSET(PO!K$12,ROW(B222)-ROW(B$12),0))","v":"15.2.1."},{"$f":"IF(OFFSET(PO!N$12,ROW(C222)-ROW(C$12),0)=0,\"\",OFFSET(PO!N$12,ROW(C222)-ROW(C$12),0))","v":"CAIXA SIFONADA, PVC, DN 150 X 150 X 50 MM, JUNTA ELÁSTICA, FORNECIDA E INSTALADA EM RAMAL DE DESCARGA OU EM RAMAL DE ESGOTO SANITÁRIO"},{"$f":"IF(OFFSET(PO!O$12,ROW(D222)-ROW(D$12),0)=0,\"\",OFFSET(PO!O$12,ROW(D222)-ROW(D$12),0))","v":"UN"},{"$f":"IF($A222<>\"Serviço\",0,ROUND(SUMIF($F$9:$P$9,\"<>\",$F222:$P222),15-13*PO!$X$3))","v":5},{"$f":"OFFSET(PO!$P$12,ROW($E222)-ROW(F$12),0)","v":5}]
[{"$f":"OFFSET(PO!J$12,ROW(A223)-ROW($A$12),0)","v":"Serviço"},{"$f":"IF($A223=0,\"\",OFFSET(PO!K$12,ROW(B223)-ROW(B$12),0))","v":"15.2.2."},{"$f":"IF(OFFSET(PO!N$12,ROW(C223)-ROW(C$12),0)=0,\"\",OFFSET(PO!N$12,ROW(C223)-ROW(C$12),0))","v":"CAIXA ENTERRADA HIDRÁULICA RETANGULAR EM ALVENARIA COM TIJOLOS CERÂMICOS MACIÇOS, DIMENSÕES INTERNAS: 0,6X0,6X0,6 M PARA REDE DE ESGOTO. AF_05/2018"},{"$f":"IF(OFFSET(PO!O$12,ROW(D223)-ROW(D$12),0)=0,\"\",OFFSET(PO!O$12,ROW(D223)-ROW(D$12),0))","v":"UN"},{"$f":"IF($A223<>\"Serviço\",0,ROUND(SUMIF($F$9:$P$9,\"<>\",$F223:$P223),15-13*PO!$X$3))","v":8},{"$f":"OFFSET(PO!$P$12,ROW($E223)-ROW(F$12),0)","v":8}]
[{"$f":"OFFSET(PO!J$12,ROW(A224)-ROW($A$12),0)","v":"Serviço"},{"$f":"IF($A224=0,\"\",OFFSET(PO!K$12,ROW(B224)-ROW(B$12),0))","v":"15.2.3."},{"$f":"IF(OFFSET(PO!N$12,ROW(C224)-ROW(C$12),0)=0,\"\",OFFSET(PO!N$12,ROW(C224)-ROW(C$12),0))","v":"CAIXA DE AREIA ENTERRADA RETANGULAR EM ALVENARIA COM TIJOLOS CERÂMICOS MACIÇOS, DIMENSÕES INTERNAS: 0,6X0,6X0,6 M PARA REDE PLUVIAL COM GRADE"},{"$f":"IF(OFFSET(PO!O$12,ROW(D224)-ROW(D$12),0)=0,\"\",OFFSET(PO!O$12,ROW(D224)-ROW(D$12),0))","v":"UN"},{"$f":"IF($A224<>\"Serviço\",0,ROUND(SUMIF($F$9:$P$9,\"<>\",$F224:$P224),15-13*PO!$X$3))","v":4},{"$f":"OFFSET(PO!$P$12,ROW($E224)-ROW(F$12),0)","v":4}]
[{"$f":"OFFSET(PO!J$12,ROW(A225)-ROW($A$12),0)","v":"Serviço"},{"$f":"IF($A225=0,\"\",OFFSET(PO!K$12,ROW(B225)-ROW(B$12),0))","v":"15.2.4."},{"$f":"IF(OFFSET(PO!N$12,ROW(C225)-ROW(C$12),0)=0,\"\",OFFSET(PO!N$12,ROW(C225)-ROW(C$12),0))","v":"CAIXA DE GORDURA PEQUENA (CAPACIDADE: 19 L), CIRCULAR, EM PVC, DIÂMETRO INTERNO= 0,3 M. AF_05/2018"},{"$f":"IF(OFFSET(PO!O$12,ROW(D225)-ROW(D$12),0)=0,\"\",OFFSET(PO!O$12,ROW(D225)-ROW(D$12),0))","v":"UN"},{"$f":"IF($A225<>\"Serviço\",0,ROUND(SUMIF($F$9:$P$9,\"<>\",$F225:$P225),15-13*PO!$X$3))","v":1},{"$f":"OFFSET(PO!$P$12,ROW($E225)-ROW(F$12),0)","v":1}]
[{"$f":"OFFSET(PO!J$12,ROW(A226)-ROW($A$12),0)","v":"Serviço"},{"$f":"IF($A226=0,\"\",OFFSET(PO!K$12,ROW(B226)-ROW(B$12),0))","v":"15.2.5."},{"$f":"IF(OFFSET(PO!N$12,ROW(C226)-ROW(C$12),0)=0,\"\",OFFSET(PO!N$12,ROW(C226)-ROW(C$12),0))","v":"TANQUE SÉPTICO CIRCULAR, EM CONCRETO PRÉ-MOLDADO, DIÂMETRO INTERNO = 1,40 M, ALTURA INTERNA = 2,50 M, VOLUME ÚTIL: 3463,6 L (PARA 13 CONTRIBUINTES), INCLUSIVE TUBULAÇÕES E CONEXÕES"},{"$f":"IF(OFFSET(PO!O$12,ROW(D226)-ROW(D$12),0)=0,\"\",OFFSET(PO!O$12,ROW(D226)-ROW(D$12),0))","v":"UN"},{"$f":"IF($A226<>\"Serviço\",0,ROUND(SUMIF($F$9:$P$9,\"<>\",$F226:$P226),15-13*PO!$X$3))","v":1},{"$f":"OFFSET(PO!$P$12,ROW($E226)-ROW(F$12),0)","v":1}]
[{"$f":"OFFSET(PO!J$12,ROW(A227)-ROW($A$12),0)","v":"Serviço"},{"$f":"IF($A227=0,\"\",OFFSET(PO!K$12,ROW(B227)-ROW(B$12),0))","v":"15.2.6."},{"$f":"IF(OFFSET(PO!N$12,ROW(C227)-ROW(C$12),0)=0,\"\",OFFSET(PO!N$12,ROW(C227)-ROW(C$12),0))","v":"SUMIDOURO CIRCULAR, EM CONCRETO PRÉ-MOLDADO, DIÂMETRO INTERNO = 2,38 M, ALTURA INTERNA = 3,0 M, ÁREA DE INFILTRAÇÃO: 25 M² (PARA 10 CONTRIBUINTES)"},{"$f":"IF(OFFSET(PO!O$12,ROW(D227)-ROW(D$12),0)=0,\"\",OFFSET(PO!O$12,ROW(D227)-ROW(D$12),0))","v":"UN"},{"$f":"IF($A227<>\"Serviço\",0,ROUND(SUMIF($F$9:$P$9,\"<>\",$F227:$P227),15-13*PO!$X$3))","v":1},{"$f":"OFFSET(PO!$P$12,ROW($E227)-ROW(F$12),0)","v":1}]
[{"$f":"OFFSET(PO!J$12,ROW(A228)-ROW($A$12),0)","v":"Serviço"},{"$f":"IF($A228=0,\"\",OFFSET(PO!K$12,ROW(B228)-ROW(B$12),0))","v":"15.2.7."},{"$f":"IF(OFFSET(PO!N$12,ROW(C228)-ROW(C$12),0)=0,\"\",OFFSET(PO!N$12,ROW(C228)-ROW(C$12),0))","v":"TERMINAL DE VENTILACAO, 50 MM, SERIE NORMAL, ESGOTO PREDIAL"},{"$f":"IF(OFFSET(PO!O$12,ROW(D228)-ROW(D$12),0)=0,\"\",OFFSET(PO!O$12,ROW(D228)-ROW(D$12),0))","v":"UN"},{"$f":"IF($A228<>\"Serviço\",0,ROUND(SUMIF($F$9:$P$9,\"<>\",$F228:$P228),15-13*PO!$X$3))","v":2},{"$f":"OFFSET(PO!$P$12,ROW($E228)-ROW(F$12),0)","v":2}]
[{"$f":"OFFSET(PO!J$12,ROW(A229)-ROW($A$12),0)","v":"Meta"},{"$f":"IF($A229=0,\"\",OFFSET(PO!K$12,ROW(B229)-ROW(B$12),0))","v":"16."},{"$f":"IF(OFFSET(PO!N$12,ROW(C229)-ROW(C$12),0)=0,\"\",OFFSET(PO!N$12,ROW(C229)-ROW(C$12),0))","v":"INSTALAÇÕES ELÉTRICAS"},{"$f":"IF(OFFSET(PO!O$12,ROW(D229)-ROW(D$12),0)=0,\"\",OFFSET(PO!O$12,ROW(D229)-ROW(D$12),0))","v":""},{"$f":"IF($A229<>\"Serviço\",0,ROUND(SUMIF($F$9:$P$9,\"<>\",$F229:$P229),15-13*PO!$X$3))","v":0},{"$f":"OFFSET(PO!$P$12,ROW($E229)-ROW(F$12),0)","v":0}]
[{"$f":"OFFSET(PO!J$12,ROW(A230)-ROW($A$12),0)","v":"Nível 2"},{"$f":"IF($A230=0,\"\",OFFSET(PO!K$12,ROW(B230)-ROW(B$12),0))","v":"16.1."},{"$f":"IF(OFFSET(PO!N$12,ROW(C230)-ROW(C$12),0)=0,\"\",OFFSET(PO!N$12,ROW(C230)-ROW(C$12),0))","v":"CENTRO DE DISTRIBUIÇÃO"},{"$f":"IF(OFFSET(PO!O$12,ROW(D230)-ROW(D$12),0)=0,\"\",OFFSET(PO!O$12,ROW(D230)-ROW(D$12),0))","v":""},{"$f":"IF($A230<>\"Serviço\",0,ROUND(SUMIF($F$9:$P$9,\"<>\",$F230:$P230),15-13*PO!$X$3))","v":0},{"$f":"OFFSET(PO!$P$12,ROW($E230)-ROW(F$12),0)","v":0}]
[{"$f":"OFFSET(PO!J$12,ROW(A231)-ROW($A$12),0)","v":"Serviço"},{"$f":"IF($A231=0,\"\",OFFSET(PO!K$12,ROW(B231)-ROW(B$12),0))","v":"16.1.1."},{"$f":"IF(OFFSET(PO!N$12,ROW(C231)-ROW(C$12),0)=0,\"\",OFFSET(PO!N$12,ROW(C231)-ROW(C$12),0))","v":"QUADRO DE DISTRIBUICAO DE ENERGIA DE EMBUTIR, EM CHAPA METALICA, PARA 40 DISJUNTORES TERMOMAGNETICOS MONOPOLARES, COM BARRAMENTO TRIFASICO E NEUTRO, FORNECIMENTO E INSTALACAO"},{"$f":"IF(OFFSET(PO!O$12,ROW(D231)-ROW(D$12),0)=0,\"\",OFFSET(PO!O$12,ROW(D231)-ROW(D$12),0))","v":"UN"},{"$f":"IF($A231<>\"Serviço\",0,ROUND(SUMIF($F$9:$P$9,\"<>\",$F231:$P231),15-13*PO!$X$3))","v":1},{"$f":"OFFSET(PO!$P$12,ROW($E231)-ROW(F$12),0)","v":1}]
[{"$f":"OFFSET(PO!J$12,ROW(A232)-ROW($A$12),0)","v":"Nível 2"},{"$f":"IF($A232=0,\"\",OFFSET(PO!K$12,ROW(B232)-ROW(B$12),0))","v":"16.2."},{"$f":"IF(OFFSET(PO!N$12,ROW(C232)-ROW(C$12),0)=0,\"\",OFFSET(PO!N$12,ROW(C232)-ROW(C$12),0))","v":"ELETRODUTOS E ACESSÓRIOS"},{"$f":"IF(OFFSET(PO!O$12,ROW(D232)-ROW(D$12),0)=0,\"\",OFFSET(PO!O$12,ROW(D232)-ROW(D$12),0))","v":""},{"$f":"IF($A232<>\"Serviço\",0,ROUND(SUMIF($F$9:$P$9,\"<>\",$F232:$P232),15-13*PO!$X$3))","v":0},{"$f":"OFFSET(PO!$P$12,ROW($E232)-ROW(F$12),0)","v":0}]
[{"$f":"OFFSET(PO!J$12,ROW(A233)-ROW($A$12),0)","v":"Serviço"},{"$f":"IF($A233=0,\"\",OFFSET(PO!K$12,ROW(B233)-ROW(B$12),0))","v":"16.2.1."},{"$f":"IF(OFFSET(PO!N$12,ROW(C233)-ROW(C$12),0)=0,\"\",OFFSET(PO!N$12,ROW(C233)-ROW(C$12),0))","v":"ELETRODUTO FLEXÍVEL CORRUGADO, PVC, DN 25 MM (3/4\"), PARA CIRCUITOS TERMINAIS, INSTALADO EM PAREDE - FORNECIMENTO E INSTALAÇÃO. AF_12/2015"},{"$f":"IF(OFFSET(PO!O$12,ROW(D233)-ROW(D$12),0)=0,\"\",OFFSET(PO!O$12,ROW(D233)-ROW(D$12),0))","v":"M"},{"$f":"IF($A233<>\"Serviço\",0,ROUND(SUMIF($F$9:$P$9,\"<>\",$F233:$P233),15-13*PO!$X$3))","v":320},{"$f":"OFFSET(PO!$P$12,ROW($E233)-ROW(F$12),0)","v":320}]
[{"$f":"OFFSET(PO!J$12,ROW(A234)-ROW($A$12),0)","v":"Serviço"},{"$f":"IF($A234=0,\"\",OFFSET(PO!K$12,ROW(B234)-ROW(B$12),0))","v":"16.2.2."},{"$f":"IF(OFFSET(PO!N$12,ROW(C234)-ROW(C$12),0)=0,\"\",OFFSET(PO!N$12,ROW(C234)-ROW(C$12),0))","v":"ELETRODUTO RÍGIDO ROSCÁVEL, PVC, DN 40 MM (1 1/4\"), PARA CIRCUITOS TERMINAIS, INSTALADO EM LAJE - FORNECIMENTO E INSTALAÇÃO. AF_12/2015"},{"$f":"IF(OFFSET(PO!O$12,ROW(D234)-ROW(D$12),0)=0,\"\",OFFSET(PO!O$12,ROW(D234)-ROW(D$12),0))","v":"M"},{"$f":"IF($A234<>\"Serviço\",0,ROUND(SUMIF($F$9:$P$9,\"<>\",$F234:$P234),15-13*PO!$X$3))","v":30},{"$f":"OFFSET(PO!$P$12,ROW($E234)-ROW(F$12),0)","v":30}]
[{"$f":"OFFSET(PO!J$12,ROW(A235)-ROW($A$12),0)","v":"Serviço"},{"$f":"IF($A235=0,\"\",OFFSET(PO!K$12,ROW(B235)-ROW(B$12),0))","v":"16.2.3."},{"$f":"IF(OFFSET(PO!N$12,ROW(C235)-ROW(C$12),0)=0,\"\",OFFSET(PO!N$12,ROW(C235)-ROW(C$12),0))","v":"CAIXA DE PASSAGEM 30X30X40 COM TAMPA E DRENO BRITA"},{"$f":"IF(OFFSET(PO!O$12,ROW(D235)-ROW(D$12),0)=0,\"\",OFFSET(PO!O$12,ROW(D235)-ROW(D$12),0))","v":"UN"},{"$f":"IF($A235<>\"Serviço\",0,ROUND(SUMIF($F$9:$P$9,\"<>\",$F235:$P235),15-13*PO!$X$3))","v":4},{"$f":"OFFSET(PO!$P$12,ROW($E235)-ROW(F$12),0)","v":4}]
[{"$f":"OFFSET(PO!J$12,ROW(A236)-ROW($A$12),0)","v":"Nível 2"},{"$f":"IF($A236=0,\"\",OFFSET(PO!K$12,ROW(B236)-ROW(B$12),0))","v":"16.3."},{"$f":"IF(OFFSET(PO!N$12,ROW(C236)-ROW(C$12),0)=0,\"\",OFFSET(PO!N$12,ROW(C236)-ROW(C$12),0))","v":"DISPOSITIVOS DE PROTEÇÃO"},{"$f":"IF(OFFSET(PO!O$12,ROW(D236)-ROW(D$12),0)=0,\"\",OFFSET(PO!O$12,ROW(D236)-ROW(D$12),0))","v":""},{"$f":"IF($A236<>\"Serviço\",0,ROUND(SUMIF($F$9:$P$9,\"<>\",$F236:$P236),15-13*PO!$X$3))","v":0},{"$f":"OFFSET(PO!$P$12,ROW($E236)-ROW(F$12),0)","v":0}]
[{"$f":"OFFSET(PO!J$12,ROW(A237)-ROW($A$12),0)","v":"Serviço"},{"$f":"IF($A237=0,\"\",OFFSET(PO!K$12,ROW(B237)-ROW(B$12),0))","v":"16.3.1."},{"$f":"IF(OFFSET(PO!N$12,ROW(C237)-ROW(C$12),0)=0,\"\",OFFSET(PO!N$12,ROW(C237)-ROW(C$12),0))","v":"DISJUNTOR TRIPOLAR TIPO DIN, CORRENTE NOMINAL DE 50A - FORNECIMENTO E INSTALAÇÃO. AF_04/2016"},{"$f":"IF(OFFSET(PO!O$12,ROW(D237)-ROW(D$12),0)=0,\"\",OFFSET(PO!O$12,ROW(D237)-ROW(D$12),0))","v":"UN"},{"$f":"IF($A237<>\"Serviço\",0,ROUND(SUMIF($F$9:$P$9,\"<>\",$F237:$P237),15-13*PO!$X$3))","v":1},{"$f":"OFFSET(PO!$P$12,ROW($E237)-ROW(F$12),0)","v":1}]
[{"$f":"OFFSET(PO!J$12,ROW(A238)-ROW($A$12),0)","v":"Serviço"},{"$f":"IF($A238=0,\"\",OFFSET(PO!K$12,ROW(B238)-ROW(B$12),0))","v":"16.3.2."},{"$f":"IF(OFFSET(PO!N$12,ROW(C238)-ROW(C$12),0)=0,\"\",OFFSET(PO!N$12,ROW(C238)-ROW(C$12),0))","v":"DISJUNTOR MONOPOLAR TIPO DIN, CORRENTE NOMINAL DE 10A - FORNECIMENTO E INSTALAÇÃO. AF_04/2016"},{"$f":"IF(OFFSET(PO!O$12,ROW(D238)-ROW(D$12),0)=0,\"\",OFFSET(PO!O$12,ROW(D238)-ROW(D$12),0))","v":"UN"},{"$f":"IF($A238<>\"Serviço\",0,ROUND(SUMIF($F$9:$P$9,\"<>\",$F238:$P238),15-13*PO!$X$3))","v":14},{"$f":"OFFSET(PO!$P$12,ROW($E238)-ROW(F$12),0)","v":14}]
[{"$f":"OFFSET(PO!J$12,ROW(A239)-ROW($A$12),0)","v":"Serviço"},{"$f":"IF($A239=0,\"\",OFFSET(PO!K$12,ROW(B239)-ROW(B$12),0))","v":"16.3.3."},{"$f":"IF(OFFSET(PO!N$12,ROW(C239)-ROW(C$12),0)=0,\"\",OFFSET(PO!N$12,ROW(C239)-ROW(C$12),0))","v":"DISJUNTOR MONOPOLAR TIPO DIN, CORRENTE NOMINAL DE 16A - FORNECIMENTO E INSTALAÇÃO. AF_04/2016"},{"$f":"IF(OFFSET(PO!O$12,ROW(D239)-ROW(D$12),0)=0,\"\",OFFSET(PO!O$12,ROW(D239)-ROW(D$12),0))","v":"UN"},{"$f":"IF($A239<>\"Serviço\",0,ROUND(SUMIF($F$9:$P$9,\"<>\",$F239:$P239),15-13*PO!$X$3))","v":5},{"$f":"OFFSET(PO!$P$12,ROW($E239)-ROW(F$12),0)","v":5}]
[{"$f":"OFFSET(PO!J$12,ROW(A240)-ROW($A$12),0)","v":"Serviço"},{"$f":"IF($A240=0,\"\",OFFSET(PO!K$12,ROW(B240)-ROW(B$12),0))","v":"16.3.4."},{"$f":"IF(OFFSET(PO!N$12,ROW(C240)-ROW(C$12),0)=0,\"\",OFFSET(PO!N$12,ROW(C240)-ROW(C$12),0))","v":"DISPOSITIVO DPS CLASSE II, 1 POLO, TENSAO MAXIMA DE 275 V, CORRENTE MAXIMA DE *90* KA (TIPO AC)"},{"$f":"IF(OFFSET(PO!O$12,ROW(D240)-ROW(D$12),0)=0,\"\",OFFSET(PO!O$12,ROW(D240)-ROW(D$12),0))","v":"UN"},{"$f":"IF($A240<>\"Serviço\",0,ROUND(SUMIF($F$9:$P$9,\"<>\",$F240:$P240),15-13*PO!$X$3))","v":4},{"$f":"OFFSET(PO!$P$12,ROW($E240)-ROW(F$12),0)","v":4}]
[{"$f":"OFFSET(PO!J$12,ROW(A241)-ROW($A$12),0)","v":"Serviço"},{"$f":"IF($A241=0,\"\",OFFSET(PO!K$12,ROW(B241)-ROW(B$12),0))","v":"16.3.5."},{"$f":"IF(OFFSET(PO!N$12,ROW(C241)-ROW(C$12),0)=0,\"\",OFFSET(PO!N$12,ROW(C241)-ROW(C$12),0))","v":"DISPOSITIVO DR, 2 POLOS, SENSIBILIDADE DE 30 MA, CORRENTE DE 25 A, TIPO AC"},{"$f":"IF(OFFSET(PO!O$12,ROW(D241)-ROW(D$12),0)=0,\"\",OFFSET(PO!O$12,ROW(D241)-ROW(D$12),0))","v":"UN"},{"$f":"IF($A241<>\"Serviço\",0,ROUND(SUMIF($F$9:$P$9,\"<>\",$F241:$P241),15-13*PO!$X$3))","v":3},{"$f":"OFFSET(PO!$P$12,ROW($E241)-ROW(F$12),0)","v":3}]
[{"$f":"OFFSET(PO!J$12,ROW(A242)-ROW($A$12),0)","v":"Nível 2"},{"$f":"IF($A242=0,\"\",OFFSET(PO!K$12,ROW(B242)-ROW(B$12),0))","v":"16.4."},{"$f":"IF(OFFSET(PO!N$12,ROW(C242)-ROW(C$12),0)=0,\"\",OFFSET(PO!N$12,ROW(C242)-ROW(C$12),0))","v":"CABOS E FIOS"},{"$f":"IF(OFFSET(PO!O$12,ROW(D242)-ROW(D$12),0)=0,\"\",OFFSET(PO!O$12,ROW(D242)-ROW(D$12),0))","v":""},{"$f":"IF($A242<>\"Serviço\",0,ROUND(SUMIF($F$9:$P$9,\"<>\",$F242:$P242),15-13*PO!$X$3))","v":0},{"$f":"OFFSET(PO!$P$12,ROW($E242)-ROW(F$12),0)","v":0}]
[{"$f":"OFFSET(PO!J$12,ROW(A243)-ROW($A$12),0)","v":"Serviço"},{"$f":"IF($A243=0,\"\",OFFSET(PO!K$12,ROW(B243)-ROW(B$12),0))","v":"16.4.1."},{"$f":"IF(OFFSET(PO!N$12,ROW(C243)-ROW(C$12),0)=0,\"\",OFFSET(PO!N$12,ROW(C243)-ROW(C$12),0))","v":"CABO DE COBRE FLEXÍVEL ISOLADO, 1,5 MM², ANTI-CHAMA 450/750 V, PARA CIRCUITOS TERMINAIS - FORNECIMENTO E INSTALAÇÃO. AF_12/2015"},{"$f":"IF(OFFSET(PO!O$12,ROW(D243)-ROW(D$12),0)=0,\"\",OFFSET(PO!O$12,ROW(D243)-ROW(D$12),0))","v":"M"},{"$f":"IF($A243<>\"Serviço\",0,ROUND(SUMIF($F$9:$P$9,\"<>\",$F243:$P243),15-13*PO!$X$3))","v":105.5},{"$f":"OFFSET(PO!$P$12,ROW($E243)-ROW(F$12),0)","v":105.5}]
[{"$f":"OFFSET(PO!J$12,ROW(A244)-ROW($A$12),0)","v":"Serviço"},{"$f":"IF($A244=0,\"\",OFFSET(PO!K$12,ROW(B244)-ROW(B$12),0))","v":"16.4.2."},{"$f":"IF(OFFSET(PO!N$12,ROW(C244)-ROW(C$12),0)=0,\"\",OFFSET(PO!N$12,ROW(C244)-ROW(C$12),0))","v":"CABO DE COBRE FLEXÍVEL ISOLADO, 2,5 MM², ANTI-CHAMA 450/750 V, PARA CIRCUITOS TERMINAIS - FORNECIMENTO E INSTALAÇÃO. AF_12/2015"},{"$f":"IF(OFFSET(PO!O$12,ROW(D244)-ROW(D$12),0)=0,\"\",OFFSET(PO!O$12,ROW(D244)-ROW(D$12),0))","v":"M"},{"$f":"IF($A244<>\"Serviço\",0,ROUND(SUMIF($F$9:$P$9,\"<>\",$F244:$P244),15-13*PO!$X$3))","v":1035.5},{"$f":"OFFSET(PO!$P$12,ROW($E244)-ROW(F$12),0)","v":1035.5}]
[{"$f":"OFFSET(PO!J$12,ROW(A245)-ROW($A$12),0)","v":"Serviço"},{"$f":"IF($A245=0,\"\",OFFSET(PO!K$12,ROW(B245)-ROW(B$12),0))","v":"16.4.3."},{"$f":"IF(OFFSET(PO!N$12,ROW(C245)-ROW(C$12),0)=0,\"\",OFFSET(PO!N$12,ROW(C245)-ROW(C$12),0))","v":"CABO DE COBRE FLEXÍVEL ISOLADO, 4 MM², ANTI-CHAMA 450/750 V, PARA CIRCUITOS TERMINAIS - FORNECIMENTO E INSTALAÇÃO. AF_12/2015"},{"$f":"IF(OFFSET(PO!O$12,ROW(D245)-ROW(D$12),0)=0,\"\",OFFSET(PO!O$12,ROW(D245)-ROW(D$12),0))","v":"M"},{"$f":"IF($A245<>\"Serviço\",0,ROUND(SUMIF($F$9:$P$9,\"<>\",$F245:$P245),15-13*PO!$X$3))","v":292.5},{"$f":"OFFSET(PO!$P$12,ROW($E245)-ROW(F$12),0)","v":292.5}]
[{"$f":"OFFSET(PO!J$12,ROW(A246)-ROW($A$12),0)","v":"Serviço"},{"$f":"IF($A246=0,\"\",OFFSET(PO!K$12,ROW(B246)-ROW(B$12),0))","v":"16.4.4."},{"$f":"IF(OFFSET(PO!N$12,ROW(C246)-ROW(C$12),0)=0,\"\",OFFSET(PO!N$12,ROW(C246)-ROW(C$12),0))","v":"CABO DE COBRE FLEXÍVEL ISOLADO, 10 MM², ANTI-CHAMA 450/750 V, PARA CIRCUITOS TERMINAIS - FORNECIMENTO E INSTALAÇÃO. AF_12/2015"},{"$f":"IF(OFFSET(PO!O$12,ROW(D246)-ROW(D$12),0)=0,\"\",OFFSET(PO!O$12,ROW(D246)-ROW(D$12),0))","v":"M"},{"$f":"IF($A246<>\"Serviço\",0,ROUND(SUMIF($F$9:$P$9,\"<>\",$F246:$P246),15-13*PO!$X$3))","v":95.5},{"$f":"OFFSET(PO!$P$12,ROW($E246)-ROW(F$12),0)","v":95.5}]
[{"$f":"OFFSET(PO!J$12,ROW(A247)-ROW($A$12),0)","v":"Nível 2"},{"$f":"IF($A247=0,\"\",OFFSET(PO!K$12,ROW(B247)-ROW(B$12),0))","v":"16.5."},{"$f":"IF(OFFSET(PO!N$12,ROW(C247)-ROW(C$12),0)=0,\"\",OFFSET(PO!N$12,ROW(C247)-ROW(C$12),0))","v":"ILUMINAÇÃO E TOMADAS"},{"$f":"IF(OFFSET(PO!O$12,ROW(D247)-ROW(D$12),0)=0,\"\",OFFSET(PO!O$12,ROW(D247)-ROW(D$12),0))","v":""},{"$f":"IF($A247<>\"Serviço\",0,ROUND(SUMIF($F$9:$P$9,\"<>\",$F247:$P247),15-13*PO!$X$3))","v":0},{"$f":"OFFSET(PO!$P$12,ROW($E247)-ROW(F$12),0)","v":0}]
[{"$f":"OFFSET(PO!J$12,ROW(A248)-ROW($A$12),0)","v":"Serviço"},{"$f":"IF($A248=0,\"\",OFFSET(PO!K$12,ROW(B248)-ROW(B$12),0))","v":"16.5.1."},{"$f":"IF(OFFSET(PO!N$12,ROW(C248)-ROW(C$12),0)=0,\"\",OFFSET(PO!N$12,ROW(C248)-ROW(C$12),0))","v":"CAIXA RETANGULAR 4\" X 2\" BAIXA (0,30 M DO PISO), PVC, INSTALADA EM PAREDE - FORNECIMENTO E INSTALAÇÃO. AF_12/2015"},{"$f":"IF(OFFSET(PO!O$12,ROW(D248)-ROW(D$12),0)=0,\"\",OFFSET(PO!O$12,ROW(D248)-ROW(D$12),0))","v":"UN"},{"$f":"IF($A248<>\"Serviço\",0,ROUND(SUMIF($F$9:$P$9,\"<>\",$F248:$P248),15-13*PO!$X$3))","v":36},{"$f":"OFFSET(PO!$P$12,ROW($E248)-ROW(F$12),0)","v":36}]
[{"$f":"OFFSET(PO!J$12,ROW(A249)-ROW($A$12),0)","v":"Serviço"},{"$f":"IF($A249=0,\"\",OFFSET(PO!K$12,ROW(B249)-ROW(B$12),0))","v":"16.5.2."},{"$f":"IF(OFFSET(PO!N$12,ROW(C249)-ROW(C$12),0)=0,\"\",OFFSET(PO!N$12,ROW(C249)-ROW(C$12),0))","v":"TOMADA BAIXA DE EMBUTIR (3 MÓDULOS), 2P+T 10 A, INCLUINDO SUPORTE E PLACA - FORNECIMENTO E INSTALAÇÃO. AF_12/2015"},{"$f":"IF(OFFSET(PO!O$12,ROW(D249)-ROW(D$12),0)=0,\"\",OFFSET(PO!O$12,ROW(D249)-ROW(D$12),0))","v":"UN"},{"$f":"IF($A249<>\"Serviço\",0,ROUND(SUMIF($F$9:$P$9,\"<>\",$F249:$P249),15-13*PO!$X$3))","v":4},{"$f":"OFFSET(PO!$P$12,ROW($E249)-ROW(F$12),0)","v":4}]
[{"$f":"OFFSET(PO!J$12,ROW(A250)-ROW($A$12),0)","v":"Serviço"},{"$f":"IF($A250=0,\"\",OFFSET(PO!K$12,ROW(B250)-ROW(B$12),0))","v":"16.5.3."},{"$f":"IF(OFFSET(PO!N$12,ROW(C250)-ROW(C$12),0)=0,\"\",OFFSET(PO!N$12,ROW(C250)-ROW(C$12),0))","v":"TOMADA BAIXA DE EMBUTIR (1 MÓDULO), 2P+T 10 A, INCLUINDO SUPORTE E PLACA - FORNECIMENTO E INSTALAÇÃO. AF_12/2015"},{"$f":"IF(OFFSET(PO!O$12,ROW(D250)-ROW(D$12),0)=0,\"\",OFFSET(PO!O$12,ROW(D250)-ROW(D$12),0))","v":"UN"},{"$f":"IF($A250<>\"Serviço\",0,ROUND(SUMIF($F$9:$P$9,\"<>\",$F250:$P250),15-13*PO!$X$3))","v":32},{"$f":"OFFSET(PO!$P$12,ROW($E250)-ROW(F$12),0)","v":32}]
[{"$f":"OFFSET(PO!J$12,ROW(A251)-ROW($A$12),0)","v":"Serviço"},{"$f":"IF($A251=0,\"\",OFFSET(PO!K$12,ROW(B251)-ROW(B$12),0))","v":"16.5.4."},{"$f":"IF(OFFSET(PO!N$12,ROW(C251)-ROW(C$12),0)=0,\"\",OFFSET(PO!N$12,ROW(C251)-ROW(C$12),0))","v":"CAIXA RETANGULAR 4\" X 2\" MÉDIA (1,30 M DO PISO), PVC, INSTALADA EM PAREDE - FORNECIMENTO E INSTALAÇÃO. AF_12/2015"},{"$f":"IF(OFFSET(PO!O$12,ROW(D251)-ROW(D$12),0)=0,\"\",OFFSET(PO!O$12,ROW(D251)-ROW(D$12),0))","v":"UN"},{"$f":"IF($A251<>\"Serviço\",0,ROUND(SUMIF($F$9:$P$9,\"<>\",$F251:$P251),15-13*PO!$X$3))","v":22},{"$f":"OFFSET(PO!$P$12,ROW($E251)-ROW(F$12),0)","v":22}]
[{"$f":"OFFSET(PO!J$12,ROW(A252)-ROW($A$12),0)","v":"Serviço"},{"$f":"IF($A252=0,\"\",OFFSET(PO!K$12,ROW(B252)-ROW(B$12),0))","v":"16.5.5."},{"$f":"IF(OFFSET(PO!N$12,ROW(C252)-ROW(C$12),0)=0,\"\",OFFSET(PO!N$12,ROW(C252)-ROW(C$12),0))","v":"TOMADA MÉDIA DE EMBUTIR (1 MÓDULO), 2P+T 10 A, INCLUINDO SUPORTE E PLACA - FORNECIMENTO E INSTALAÇÃO. AF_12/2015"},{"$f":"IF(OFFSET(PO!O$12,ROW(D252)-ROW(D$12),0)=0,\"\",OFFSET(PO!O$12,ROW(D252)-ROW(D$12),0))","v":"UN"},{"$f":"IF($A252<>\"Serviço\",0,ROUND(SUMIF($F$9:$P$9,\"<>\",$F252:$P252),15-13*PO!$X$3))","v":7},{"$f":"OFFSET(PO!$P$12,ROW($E252)-ROW(F$12),0)","v":7}]
[{"$f":"OFFSET(PO!J$12,ROW(A253)-ROW($A$12),0)","v":"Serviço"},{"$f":"IF($A253=0,\"\",OFFSET(PO!K$12,ROW(B253)-ROW(B$12),0))","v":"16.5.6."},{"$f":"IF(OFFSET(PO!N$12,ROW(C253)-ROW(C$12),0)=0,\"\",OFFSET(PO!N$12,ROW(C253)-ROW(C$12),0))","v":"CAIXA RETANGULAR 4\" X 2\" ALTA (2,00 M DO PISO), PVC, INSTALADA EM PAREDE - FORNECIMENTO E INSTALAÇÃO. AF_12/2015"},{"$f":"IF(OFFSET(PO!O$12,ROW(D253)-ROW(D$12),0)=0,\"\",OFFSET(PO!O$12,ROW(D253)-ROW(D$12),0))","v":"UN"},{"$f":"IF($A253<>\"Serviço\",0,ROUND(SUMIF($F$9:$P$9,\"<>\",$F253:$P253),15-13*PO!$X$3))","v":14},{"$f":"OFFSET(PO!$P$12,ROW($E253)-ROW(F$12),0)","v":14}]
[{"$f":"OFFSET(PO!J$12,ROW(A254)-ROW($A$12),0)","v":"Serviço"},{"$f":"IF($A254=0,\"\",OFFSET(PO!K$12,ROW(B254)-ROW(B$12),0))","v":"16.5.7."},{"$f":"IF(OFFSET(PO!N$12,ROW(C254)-ROW(C$12),0)=0,\"\",OFFSET(PO!N$12,ROW(C254)-ROW(C$12),0))","v":"TOMADA ALTA DE EMBUTIR (1 MÓDULO), 2P+T 10 A, INCLUINDO SUPORTE E PLACA - FORNECIMENTO E INSTALAÇÃO. AF_12/2015"},{"$f":"IF(OFFSET(PO!O$12,ROW(D254)-ROW(D$12),0)=0,\"\",OFFSET(PO!O$12,ROW(D254)-ROW(D$12),0))","v":"UN"},{"$f":"IF($A254<>\"Serviço\",0,ROUND(SUMIF($F$9:$P$9,\"<>\",$F254:$P254),15-13*PO!$X$3))","v":10},{"$f":"OFFSET(PO!$P$12,ROW($E254)-ROW(F$12),0)","v":10}]
[{"$f":"OFFSET(PO!J$12,ROW(A255)-ROW($A$12),0)","v":"Serviço"},{"$f":"IF($A255=0,\"\",OFFSET(PO!K$12,ROW(B255)-ROW(B$12),0))","v":"16.5.8."},{"$f":"IF(OFFSET(PO!N$12,ROW(C255)-ROW(C$12),0)=0,\"\",OFFSET(PO!N$12,ROW(C255)-ROW(C$12),0))","v":"INTERRUPTOR SIMPLES (1 MÓDULO) COM 1 TOMADA DE EMBUTIR 2P+T 10 A,  INCLUINDO SUPORTE E PLACA - FORNECIMENTO E INSTALAÇÃO. AF_12/2015"},{"$f":"IF(OFFSET(PO!O$12,ROW(D255)-ROW(D$12),0)=0,\"\",OFFSET(PO!O$12,ROW(D255)-ROW(D$12),0))","v":"UN"},{"$f":"IF($A255<>\"Serviço\",0,ROUND(SUMIF($F$9:$P$9,\"<>\",$F255:$P255),15-13*PO!$X$3))","v":5},{"$f":"OFFSET(PO!$P$12,ROW($E255)-ROW(F$12),0)","v":5}]
[{"$f":"OFFSET(PO!J$12,ROW(A256)-ROW($A$12),0)","v":"Serviço"},{"$f":"IF($A256=0,\"\",OFFSET(PO!K$12,ROW(B256)-ROW(B$12),0))","v":"16.5.9."},{"$f":"IF(OFFSET(PO!N$12,ROW(C256)-ROW(C$12),0)=0,\"\",OFFSET(PO!N$12,ROW(C256)-ROW(C$12),0))","v":"INTERRUPTOR SIMPLES (1 MÓDULO) COM INTERRUPTOR PARALELO (1 MÓDULO), 10A/250V, INCLUINDO SUPORTE E PLACA - FORNECIMENTO E INSTALAÇÃO. AF_12/2015"},{"$f":"IF(OFFSET(PO!O$12,ROW(D256)-ROW(D$12),0)=0,\"\",OFFSET(PO!O$12,ROW(D256)-ROW(D$12),0))","v":"UN"},{"$f":"IF($A256<>\"Serviço\",0,ROUND(SUMIF($F$9:$P$9,\"<>\",$F256:$P256),15-13*PO!$X$3))","v":1},{"$f":"OFFSET(PO!$P$12,ROW($E256)-ROW(F$12),0)","v":1}]
[{"$f":"OFFSET(PO!J$12,ROW(A257)-ROW($A$12),0)","v":"Serviço"},{"$f":"IF($A257=0,\"\",OFFSET(PO!K$12,ROW(B257)-ROW(B$12),0))","v":"16.5.10."},{"$f":"IF(OFFSET(PO!N$12,ROW(C257)-ROW(C$12),0)=0,\"\",OFFSET(PO!N$12,ROW(C257)-ROW(C$12),0))","v":"INTERRUPTOR PARALELO (2 MÓDULOS), 10A/250V, INCLUINDO SUPORTE E PLACA - FORNECIMENTO E INSTALAÇÃO. AF_12/2015"},{"$f":"IF(OFFSET(PO!O$12,ROW(D257)-ROW(D$12),0)=0,\"\",OFFSET(PO!O$12,ROW(D257)-ROW(D$12),0))","v":"UN"},{"$f":"IF($A257<>\"Serviço\",0,ROUND(SUMIF($F$9:$P$9,\"<>\",$F257:$P257),15-13*PO!$X$3))","v":1},{"$f":"OFFSET(PO!$P$12,ROW($E257)-ROW(F$12),0)","v":1}]
[{"$f":"OFFSET(PO!J$12,ROW(A258)-ROW($A$12),0)","v":"Serviço"},{"$f":"IF($A258=0,\"\",OFFSET(PO!K$12,ROW(B258)-ROW(B$12),0))","v":"16.5.11."},{"$f":"IF(OFFSET(PO!N$12,ROW(C258)-ROW(C$12),0)=0,\"\",OFFSET(PO!N$12,ROW(C258)-ROW(C$12),0))","v":"INTERRUPTOR PARALELO (1 MÓDULO), 10A/250V, INCLUINDO SUPORTE E PLACA - FORNECIMENTO E INSTALAÇÃO. AF_12/2015"},{"$f":"IF(OFFSET(PO!O$12,ROW(D258)-ROW(D$12),0)=0,\"\",OFFSET(PO!O$12,ROW(D258)-ROW(D$12),0))","v":"UN"},{"$f":"IF($A258<>\"Serviço\",0,ROUND(SUMIF($F$9:$P$9,\"<>\",$F258:$P258),15-13*PO!$X$3))","v":3},{"$f":"OFFSET(PO!$P$12,ROW($E258)-ROW(F$12),0)","v":3}]
[{"$f":"OFFSET(PO!J$12,ROW(A259)-ROW($A$12),0)","v":"Serviço"},{"$f":"IF($A259=0,\"\",OFFSET(PO!K$12,ROW(B259)-ROW(B$12),0))","v":"16.5.12."},{"$f":"IF(OFFSET(PO!N$12,ROW(C259)-ROW(C$12),0)=0,\"\",OFFSET(PO!N$12,ROW(C259)-ROW(C$12),0))","v":"INTERRUPTOR SIMPLES (1 MÓDULO), 10A/250V, INCLUINDO SUPORTE E PLACA - FORNECIMENTO E INSTALAÇÃO. AF_12/2015"},{"$f":"IF(OFFSET(PO!O$12,ROW(D259)-ROW(D$12),0)=0,\"\",OFFSET(PO!O$12,ROW(D259)-ROW(D$12),0))","v":"UN"},{"$f":"IF($A259<>\"Serviço\",0,ROUND(SUMIF($F$9:$P$9,\"<>\",$F259:$P259),15-13*PO!$X$3))","v":5},{"$f":"OFFSET(PO!$P$12,ROW($E259)-ROW(F$12),0)","v":5}]
[{"$f":"OFFSET(PO!J$12,ROW(A260)-ROW($A$12),0)","v":"Serviço"},{"$f":"IF($A260=0,\"\",OFFSET(PO!K$12,ROW(B260)-ROW(B$12),0))","v":"16.5.13."},{"$f":"IF(OFFSET(PO!N$12,ROW(C260)-ROW(C$12),0)=0,\"\",OFFSET(PO!N$12,ROW(C260)-ROW(C$12),0))","v":"TOMADA DE PISO COMPLETA (2 MÓDULOS), INCLUINDO CAIXA DE PISO EM ALUMÍNIO P/ DUAS TOMADAS (4X4\"), PLACA EM LATÃO COM 2 TAMPAS UNHA - LIXADA, 2 TOMADAS 2P+T 20A"},{"$f":"IF(OFFSET(PO!O$12,ROW(D260)-ROW(D$12),0)=0,\"\",OFFSET(PO!O$12,ROW(D260)-ROW(D$12),0))","v":"UN"},{"$f":"IF($A260<>\"Serviço\",0,ROUND(SUMIF($F$9:$P$9,\"<>\",$F260:$P260),15-13*PO!$X$3))","v":2},{"$f":"OFFSET(PO!$P$12,ROW($E260)-ROW(F$12),0)","v":2}]
[{"$f":"OFFSET(PO!J$12,ROW(A261)-ROW($A$12),0)","v":"Serviço"},{"$f":"IF($A261=0,\"\",OFFSET(PO!K$12,ROW(B261)-ROW(B$12),0))","v":"16.5.14."},{"$f":"IF(OFFSET(PO!N$12,ROW(C261)-ROW(C$12),0)=0,\"\",OFFSET(PO!N$12,ROW(C261)-ROW(C$12),0))","v":"LUMINARIA LED REFLETOR RETANGULAR BIVOLT, LUZ BRANCA, 50 W"},{"$f":"IF(OFFSET(PO!O$12,ROW(D261)-ROW(D$12),0)=0,\"\",OFFSET(PO!O$12,ROW(D261)-ROW(D$12),0))","v":"UN"},{"$f":"IF($A261<>\"Serviço\",0,ROUND(SUMIF($F$9:$P$9,\"<>\",$F261:$P261),15-13*PO!$X$3))","v":3},{"$f":"OFFSET(PO!$P$12,ROW($E261)-ROW(F$12),0)","v":3}]
[{"$f":"OFFSET(PO!J$12,ROW(A262)-ROW($A$12),0)","v":"Serviço"},{"$f":"IF($A262=0,\"\",OFFSET(PO!K$12,ROW(B262)-ROW(B$12),0))","v":"16.5.15."},{"$f":"IF(OFFSET(PO!N$12,ROW(C262)-ROW(C$12),0)=0,\"\",OFFSET(PO!N$12,ROW(C262)-ROW(C$12),0))","v":"RELE FOTOELETRICO P/ COMANDO DE ILUMINACAO EXTERNA 220V/1000W - FORNECIMENTO E INSTALACAO"},{"$f":"IF(OFFSET(PO!O$12,ROW(D262)-ROW(D$12),0)=0,\"\",OFFSET(PO!O$12,ROW(D262)-ROW(D$12),0))","v":"UN"},{"$f":"IF($A262<>\"Serviço\",0,ROUND(SUMIF($F$9:$P$9,\"<>\",$F262:$P262),15-13*PO!$X$3))","v":2},{"$f":"OFFSET(PO!$P$12,ROW($E262)-ROW(F$12),0)","v":2}]
[{"$f":"OFFSET(PO!J$12,ROW(A263)-ROW($A$12),0)","v":"Serviço"},{"$f":"IF($A263=0,\"\",OFFSET(PO!K$12,ROW(B263)-ROW(B$12),0))","v":"16.5.16."},{"$f":"IF(OFFSET(PO!N$12,ROW(C263)-ROW(C$12),0)=0,\"\",OFFSET(PO!N$12,ROW(C263)-ROW(C$12),0))","v":"LUMINÁRIA ARANDELA TIPO TARTARUGA PARA 1 LÂMPADA LED - FORNECIMENTO E INSTALAÇÃO. AF_11/2017"},{"$f":"IF(OFFSET(PO!O$12,ROW(D263)-ROW(D$12),0)=0,\"\",OFFSET(PO!O$12,ROW(D263)-ROW(D$12),0))","v":"UN"},{"$f":"IF($A263<>\"Serviço\",0,ROUND(SUMIF($F$9:$P$9,\"<>\",$F263:$P263),15-13*PO!$X$3))","v":2},{"$f":"OFFSET(PO!$P$12,ROW($E263)-ROW(F$12),0)","v":2}]
[{"$f":"OFFSET(PO!J$12,ROW(A264)-ROW($A$12),0)","v":"Serviço"},{"$f":"IF($A264=0,\"\",OFFSET(PO!K$12,ROW(B264)-ROW(B$12),0))","v":"16.5.17."},{"$f":"IF(OFFSET(PO!N$12,ROW(C264)-ROW(C$12),0)=0,\"\",OFFSET(PO!N$12,ROW(C264)-ROW(C$12),0))","v":"LUMINÁRIAS TIPO CALHA, DE SOBREPOR, COM REATORES DE PARTIDA RÁPIDA E LÂMPADAS FLUORESCENTES 2X2X36W, COMPLETAS, FORNECIMENTO E INSTALAÇÃO"},{"$f":"IF(OFFSET(PO!O$12,ROW(D264)-ROW(D$12),0)=0,\"\",OFFSET(PO!O$12,ROW(D264)-ROW(D$12),0))","v":"UN"},{"$f":"IF($A264<>\"Serviço\",0,ROUND(SUMIF($F$9:$P$9,\"<>\",$F264:$P264),15-13*PO!$X$3))","v":2},{"$f":"OFFSET(PO!$P$12,ROW($E264)-ROW(F$12),0)","v":2}]
[{"$f":"OFFSET(PO!J$12,ROW(A265)-ROW($A$12),0)","v":"Serviço"},{"$f":"IF($A265=0,\"\",OFFSET(PO!K$12,ROW(B265)-ROW(B$12),0))","v":"16.5.18."},{"$f":"IF(OFFSET(PO!N$12,ROW(C265)-ROW(C$12),0)=0,\"\",OFFSET(PO!N$12,ROW(C265)-ROW(C$12),0))","v":"LUMINARIA LED PLAFON QUADRADA DE SOBREPOR BIVOLT, MÍNIMO 20 W, MÍNIMO 2000 LUMENS, BRANCO FRIO, EM ALUMÍNIO, FP>0,95, INCLUSO DRIVER - FORNECIMENTO E INSTALAÇÃO"},{"$f":"IF(OFFSET(PO!O$12,ROW(D265)-ROW(D$12),0)=0,\"\",OFFSET(PO!O$12,ROW(D265)-ROW(D$12),0))","v":"UN"},{"$f":"IF($A265<>\"Serviço\",0,ROUND(SUMIF($F$9:$P$9,\"<>\",$F265:$P265),15-13*PO!$X$3))","v":13},{"$f":"OFFSET(PO!$P$12,ROW($E265)-ROW(F$12),0)","v":13}]
[{"$f":"OFFSET(PO!J$12,ROW(A266)-ROW($A$12),0)","v":"Serviço"},{"$f":"IF($A266=0,\"\",OFFSET(PO!K$12,ROW(B266)-ROW(B$12),0))","v":"16.5.19."},{"$f":"IF(OFFSET(PO!N$12,ROW(C266)-ROW(C$12),0)=0,\"\",OFFSET(PO!N$12,ROW(C266)-ROW(C$12),0))","v":"LUMINÁRIA TIPO CALHA, DE SOBREPOR, COM 4 LÂMPADAS TUBULARES DE 32 W - FORNECIMENTO E INSTALAÇÃO"},{"$f":"IF(OFFSET(PO!O$12,ROW(D266)-ROW(D$12),0)=0,\"\",OFFSET(PO!O$12,ROW(D266)-ROW(D$12),0))","v":"UN"},{"$f":"IF($A266<>\"Serviço\",0,ROUND(SUMIF($F$9:$P$9,\"<>\",$F266:$P266),15-13*PO!$X$3))","v":12},{"$f":"OFFSET(PO!$P$12,ROW($E266)-ROW(F$12),0)","v":12}]
[{"$f":"OFFSET(PO!J$12,ROW(A267)-ROW($A$12),0)","v":"Serviço"},{"$f":"IF($A267=0,\"\",OFFSET(PO!K$12,ROW(B267)-ROW(B$12),0))","v":"16.5.20."},{"$f":"IF(OFFSET(PO!N$12,ROW(C267)-ROW(C$12),0)=0,\"\",OFFSET(PO!N$12,ROW(C267)-ROW(C$12),0))","v":"CAIXA OCTOGONAL 4\" X 4\", PVC, INSTALADA EM LAJE - FORNECIMENTO E INSTALAÇÃO. AF_12/2015"},{"$f":"IF(OFFSET(PO!O$12,ROW(D267)-ROW(D$12),0)=0,\"\",OFFSET(PO!O$12,ROW(D267)-ROW(D$12),0))","v":"UN"},{"$f":"IF($A267<>\"Serviço\",0,ROUND(SUMIF($F$9:$P$9,\"<>\",$F267:$P267),15-13*PO!$X$3))","v":27},{"$f":"OFFSET(PO!$P$12,ROW($E267)-ROW(F$12),0)","v":27}]
[{"$f":"OFFSET(PO!J$12,ROW(A268)-ROW($A$12),0)","v":"Meta"},{"$f":"IF($A268=0,\"\",OFFSET(PO!K$12,ROW(B268)-ROW(B$12),0))","v":"17."},{"$f":"IF(OFFSET(PO!N$12,ROW(C268)-ROW(C$12),0)=0,\"\",OFFSET(PO!N$12,ROW(C268)-ROW(C$12),0))","v":"INSTALAÇÕES TELEFÔNICAS, LÓGICA E ALARME"},{"$f":"IF(OFFSET(PO!O$12,ROW(D268)-ROW(D$12),0)=0,\"\",OFFSET(PO!O$12,ROW(D268)-ROW(D$12),0))","v":""},{"$f":"IF($A268<>\"Serviço\",0,ROUND(SUMIF($F$9:$P$9,\"<>\",$F268:$P268),15-13*PO!$X$3))","v":0},{"$f":"OFFSET(PO!$P$12,ROW($E268)-ROW(F$12),0)","v":0}]
[{"$f":"OFFSET(PO!J$12,ROW(A269)-ROW($A$12),0)","v":"Serviço"},{"$f":"IF($A269=0,\"\",OFFSET(PO!K$12,ROW(B269)-ROW(B$12),0))","v":"17.0.1."},{"$f":"IF(OFFSET(PO!N$12,ROW(C269)-ROW(C$12),0)=0,\"\",OFFSET(PO!N$12,ROW(C269)-ROW(C$12),0))","v":"CABO ELETRÔNICO CATEGORIA 5E, INSTALADO EM EDIFICAÇÃO INSTITUCIONAL - FORNECIMENTO E INSTALAÇÃO. AF_03/2018"},{"$f":"IF(OFFSET(PO!O$12,ROW(D269)-ROW(D$12),0)=0,\"\",OFFSET(PO!O$12,ROW(D269)-ROW(D$12),0))","v":"M"},{"$f":"IF($A269<>\"Serviço\",0,ROUND(SUMIF($F$9:$P$9,\"<>\",$F269:$P269),15-13*PO!$X$3))","v":110},{"$f":"OFFSET(PO!$P$12,ROW($E269)-ROW(F$12),0)","v":110}]
[{"$f":"OFFSET(PO!J$12,ROW(A270)-ROW($A$12),0)","v":"Serviço"},{"$f":"IF($A270=0,\"\",OFFSET(PO!K$12,ROW(B270)-ROW(B$12),0))","v":"17.0.2."},{"$f":"IF(OFFSET(PO!N$12,ROW(C270)-ROW(C$12),0)=0,\"\",OFFSET(PO!N$12,ROW(C270)-ROW(C$12),0))","v":"CABO TELEFÔNICO CCI-50 2 PARES, SEM BLINDAGEM, INSTALADO EM DISTRIBUIÇÃO DE EDIFICAÇÃO INSTITUCIONAL - FORNECIMENTO E INSTALAÇÃO. AF_03/2018"},{"$f":"IF(OFFSET(PO!O$12,ROW(D270)-ROW(D$12),0)=0,\"\",OFFSET(PO!O$12,ROW(D270)-ROW(D$12),0))","v":"M"},{"$f":"IF($A270<>\"Serviço\",0,ROUND(SUMIF($F$9:$P$9,\"<>\",$F270:$P270),15-13*PO!$X$3))","v":80},{"$f":"OFFSET(PO!$P$12,ROW($E270)-ROW(F$12),0)","v":80}]
[{"$f":"OFFSET(PO!J$12,ROW(A271)-ROW($A$12),0)","v":"Serviço"},{"$f":"IF($A271=0,\"\",OFFSET(PO!K$12,ROW(B271)-ROW(B$12),0))","v":"17.0.3."},{"$f":"IF(OFFSET(PO!N$12,ROW(C271)-ROW(C$12),0)=0,\"\",OFFSET(PO!N$12,ROW(C271)-ROW(C$12),0))","v":"CABO COAXIAL RG6 95% MALHA, INSTALADO EM EDIFICAÇÃO INSTITUCIONAL - FORNECIMENTO E INSTALAÇÃO."},{"$f":"IF(OFFSET(PO!O$12,ROW(D271)-ROW(D$12),0)=0,\"\",OFFSET(PO!O$12,ROW(D271)-ROW(D$12),0))","v":"M"},{"$f":"IF($A271<>\"Serviço\",0,ROUND(SUMIF($F$9:$P$9,\"<>\",$F271:$P271),15-13*PO!$X$3))","v":37},{"$f":"OFFSET(PO!$P$12,ROW($E271)-ROW(F$12),0)","v":37}]
[{"$f":"OFFSET(PO!J$12,ROW(A272)-ROW($A$12),0)","v":"Serviço"},{"$f":"IF($A272=0,\"\",OFFSET(PO!K$12,ROW(B272)-ROW(B$12),0))","v":"17.0.4."},{"$f":"IF(OFFSET(PO!N$12,ROW(C272)-ROW(C$12),0)=0,\"\",OFFSET(PO!N$12,ROW(C272)-ROW(C$12),0))","v":"CABO 2 PARES - CCI 4X50 - BRANCO, PARA ALARME - FORNECIMENTO E INSTALAÇÃO"},{"$f":"IF(OFFSET(PO!O$12,ROW(D272)-ROW(D$12),0)=0,\"\",OFFSET(PO!O$12,ROW(D272)-ROW(D$12),0))","v":"M"},{"$f":"IF($A272<>\"Serviço\",0,ROUND(SUMIF($F$9:$P$9,\"<>\",$F272:$P272),15-13*PO!$X$3))","v":130},{"$f":"OFFSET(PO!$P$12,ROW($E272)-ROW(F$12),0)","v":130}]
[{"$f":"OFFSET(PO!J$12,ROW(A273)-ROW($A$12),0)","v":"Serviço"},{"$f":"IF($A273=0,\"\",OFFSET(PO!K$12,ROW(B273)-ROW(B$12),0))","v":"17.0.5."},{"$f":"IF(OFFSET(PO!N$12,ROW(C273)-ROW(C$12),0)=0,\"\",OFFSET(PO!N$12,ROW(C273)-ROW(C$12),0))","v":"CABO FLEXIVEL PVC 750 V, 2 CONDUTORES DE 1,5 MM2"},{"$f":"IF(OFFSET(PO!O$12,ROW(D273)-ROW(D$12),0)=0,\"\",OFFSET(PO!O$12,ROW(D273)-ROW(D$12),0))","v":"M"},{"$f":"IF($A273<>\"Serviço\",0,ROUND(SUMIF($F$9:$P$9,\"<>\",$F273:$P273),15-13*PO!$X$3))","v":7.8},{"$f":"OFFSET(PO!$P$12,ROW($E273)-ROW(F$12),0)","v":7.8}]
[{"$f":"OFFSET(PO!J$12,ROW(A274)-ROW($A$12),0)","v":"Serviço"},{"$f":"IF($A274=0,\"\",OFFSET(PO!K$12,ROW(B274)-ROW(B$12),0))","v":"17.0.6."},{"$f":"IF(OFFSET(PO!N$12,ROW(C274)-ROW(C$12),0)=0,\"\",OFFSET(PO!N$12,ROW(C274)-ROW(C$12),0))","v":"ELETRODUTO FLEXÍVEL CORRUGADO, PVC, DN 25 MM (3/4\"), PARA CIRCUITOS TERMINAIS, INSTALADO EM LAJE - FORNECIMENTO E INSTALAÇÃO. AF_12/2015"},{"$f":"IF(OFFSET(PO!O$12,ROW(D274)-ROW(D$12),0)=0,\"\",OFFSET(PO!O$12,ROW(D274)-ROW(D$12),0))","v":"M"},{"$f":"IF($A274<>\"Serviço\",0,ROUND(SUMIF($F$9:$P$9,\"<>\",$F274:$P274),15-13*PO!$X$3))","v":78},{"$f":"OFFSET(PO!$P$12,ROW($E274)-ROW(F$12),0)","v":78}]
[{"$f":"OFFSET(PO!J$12,ROW(A275)-ROW($A$12),0)","v":"Serviço"},{"$f":"IF($A275=0,\"\",OFFSET(PO!K$12,ROW(B275)-ROW(B$12),0))","v":"17.0.7."},{"$f":"IF(OFFSET(PO!N$12,ROW(C275)-ROW(C$12),0)=0,\"\",OFFSET(PO!N$12,ROW(C275)-ROW(C$12),0))","v":"ELETRODUTO FLEXÍVEL CORRUGADO, PVC, DN 20 MM (1/2\"), PARA CIRCUITOS TERMINAIS, INSTALADO EM LAJE - FORNECIMENTO E INSTALAÇÃO. AF_12/2015"},{"$f":"IF(OFFSET(PO!O$12,ROW(D275)-ROW(D$12),0)=0,\"\",OFFSET(PO!O$12,ROW(D275)-ROW(D$12),0))","v":"M"},{"$f":"IF($A275<>\"Serviço\",0,ROUND(SUMIF($F$9:$P$9,\"<>\",$F275:$P275),15-13*PO!$X$3))","v":49.4},{"$f":"OFFSET(PO!$P$12,ROW($E275)-ROW(F$12),0)","v":49.4}]
[{"$f":"OFFSET(PO!J$12,ROW(A276)-ROW($A$12),0)","v":"Serviço"},{"$f":"IF($A276=0,\"\",OFFSET(PO!K$12,ROW(B276)-ROW(B$12),0))","v":"17.0.8."},{"$f":"IF(OFFSET(PO!N$12,ROW(C276)-ROW(C$12),0)=0,\"\",OFFSET(PO!N$12,ROW(C276)-ROW(C$12),0))","v":"TOMADA DE PISO,  INCLUINDO CAIXA DE PISO EM ALUMÍNIO 4X2\", PLACA EM LATÃO COM TAMPA UNHA - LIXADA, SUPORTES, 1 TOMADA FÊMEA PARA RJ-45 (LÓGICA) E TOMADA FÊMEA PARA RJ-11(TELEFÔNICA)"},{"$f":"IF(OFFSET(PO!O$12,ROW(D276)-ROW(D$12),0)=0,\"\",OFFSET(PO!O$12,ROW(D276)-ROW(D$12),0))","v":"UN"},{"$f":"IF($A276<>\"Serviço\",0,ROUND(SUMIF($F$9:$P$9,\"<>\",$F276:$P276),15-13*PO!$X$3))","v":2},{"$f":"OFFSET(PO!$P$12,ROW($E276)-ROW(F$12),0)","v":2}]
[{"$f":"OFFSET(PO!J$12,ROW(A277)-ROW($A$12),0)","v":"Serviço"},{"$f":"IF($A277=0,\"\",OFFSET(PO!K$12,ROW(B277)-ROW(B$12),0))","v":"17.0.9."},{"$f":"IF(OFFSET(PO!N$12,ROW(C277)-ROW(C$12),0)=0,\"\",OFFSET(PO!N$12,ROW(C277)-ROW(C$12),0))","v":"CAIXA RETANGULAR 4\" X 2\" BAIXA (0,30 M DO PISO), PVC, INSTALADA EM PAREDE - FORNECIMENTO E INSTALAÇÃO. AF_12/2015"},{"$f":"IF(OFFSET(PO!O$12,ROW(D277)-ROW(D$12),0)=0,\"\",OFFSET(PO!O$12,ROW(D277)-ROW(D$12),0))","v":"UN"},{"$f":"IF($A277<>\"Serviço\",0,ROUND(SUMIF($F$9:$P$9,\"<>\",$F277:$P277),15-13*PO!$X$3))","v":6},{"$f":"OFFSET(PO!$P$12,ROW($E277)-ROW(F$12),0)","v":6}]
[{"$f":"OFFSET(PO!J$12,ROW(A278)-ROW($A$12),0)","v":"Serviço"},{"$f":"IF($A278=0,\"\",OFFSET(PO!K$12,ROW(B278)-ROW(B$12),0))","v":"17.0.10."},{"$f":"IF(OFFSET(PO!N$12,ROW(C278)-ROW(C$12),0)=0,\"\",OFFSET(PO!N$12,ROW(C278)-ROW(C$12),0))","v":"CAIXA RETANGULAR 4\" X 2\" MÉDIA (1,30 M DO PISO), PVC, INSTALADA EM PAREDE - FORNECIMENTO E INSTALAÇÃO. AF_12/2015"},{"$f":"IF(OFFSET(PO!O$12,ROW(D278)-ROW(D$12),0)=0,\"\",OFFSET(PO!O$12,ROW(D278)-ROW(D$12),0))","v":"UN"},{"$f":"IF($A278<>\"Serviço\",0,ROUND(SUMIF($F$9:$P$9,\"<>\",$F278:$P278),15-13*PO!$X$3))","v":3},{"$f":"OFFSET(PO!$P$12,ROW($E278)-ROW(F$12),0)","v":3}]
[{"$f":"OFFSET(PO!J$12,ROW(A279)-ROW($A$12),0)","v":"Serviço"},{"$f":"IF($A279=0,\"\",OFFSET(PO!K$12,ROW(B279)-ROW(B$12),0))","v":"17.0.11."},{"$f":"IF(OFFSET(PO!N$12,ROW(C279)-ROW(C$12),0)=0,\"\",OFFSET(PO!N$12,ROW(C279)-ROW(C$12),0))","v":"CAIXA RETANGULAR 4\" X 2\" ALTA (2,00 M DO PISO), PVC, INSTALADA EM PAREDE - FORNECIMENTO E INSTALAÇÃO. AF_12/2015"},{"$f":"IF(OFFSET(PO!O$12,ROW(D279)-ROW(D$12),0)=0,\"\",OFFSET(PO!O$12,ROW(D279)-ROW(D$12),0))","v":"UN"},{"$f":"IF($A279<>\"Serviço\",0,ROUND(SUMIF($F$9:$P$9,\"<>\",$F279:$P279),15-13*PO!$X$3))","v":22},{"$f":"OFFSET(PO!$P$12,ROW($E279)-ROW(F$12),0)","v":22}]
[{"$f":"OFFSET(PO!J$12,ROW(A280)-ROW($A$12),0)","v":"Serviço"},{"$f":"IF($A280=0,\"\",OFFSET(PO!K$12,ROW(B280)-ROW(B$12),0))","v":"17.0.12."},{"$f":"IF(OFFSET(PO!N$12,ROW(C280)-ROW(C$12),0)=0,\"\",OFFSET(PO!N$12,ROW(C280)-ROW(C$12),0))","v":"CAIXA RETANGULAR 4\" X 4\" BAIXA (0,30 M DO PISO), PVC, INSTALADA EM PAREDE - FORNECIMENTO E INSTALAÇÃO. AF_12/2015"},{"$f":"IF(OFFSET(PO!O$12,ROW(D280)-ROW(D$12),0)=0,\"\",OFFSET(PO!O$12,ROW(D280)-ROW(D$12),0))","v":"UN"},{"$f":"IF($A280<>\"Serviço\",0,ROUND(SUMIF($F$9:$P$9,\"<>\",$F280:$P280),15-13*PO!$X$3))","v":1},{"$f":"OFFSET(PO!$P$12,ROW($E280)-ROW(F$12),0)","v":1}]
[{"$f":"OFFSET(PO!J$12,ROW(A281)-ROW($A$12),0)","v":"Serviço"},{"$f":"IF($A281=0,\"\",OFFSET(PO!K$12,ROW(B281)-ROW(B$12),0))","v":"17.0.13."},{"$f":"IF(OFFSET(PO!N$12,ROW(C281)-ROW(C$12),0)=0,\"\",OFFSET(PO!N$12,ROW(C281)-ROW(C$12),0))","v":"TAMPA CEGA EM PVC PARA CONDULETE 4 X 2\""},{"$f":"IF(OFFSET(PO!O$12,ROW(D281)-ROW(D$12),0)=0,\"\",OFFSET(PO!O$12,ROW(D281)-ROW(D$12),0))","v":"UN"},{"$f":"IF($A281<>\"Serviço\",0,ROUND(SUMIF($F$9:$P$9,\"<>\",$F281:$P281),15-13*PO!$X$3))","v":3},{"$f":"OFFSET(PO!$P$12,ROW($E281)-ROW(F$12),0)","v":3}]
[{"$f":"OFFSET(PO!J$12,ROW(A282)-ROW($A$12),0)","v":"Serviço"},{"$f":"IF($A282=0,\"\",OFFSET(PO!K$12,ROW(B282)-ROW(B$12),0))","v":"17.0.14."},{"$f":"IF(OFFSET(PO!N$12,ROW(C282)-ROW(C$12),0)=0,\"\",OFFSET(PO!N$12,ROW(C282)-ROW(C$12),0))","v":"TOMADA BAIXA DE EMBUTIR (3 MÓDULOS: 1 RJ 45, 1 RJ 11, 1 CEGO ), DETALHE 3, INCLUINDO SUPORTE E PLACA - FORNECIMENTO E INSTALAÇÃO."},{"$f":"IF(OFFSET(PO!O$12,ROW(D282)-ROW(D$12),0)=0,\"\",OFFSET(PO!O$12,ROW(D282)-ROW(D$12),0))","v":"UN"},{"$f":"IF($A282<>\"Serviço\",0,ROUND(SUMIF($F$9:$P$9,\"<>\",$F282:$P282),15-13*PO!$X$3))","v":3},{"$f":"OFFSET(PO!$P$12,ROW($E282)-ROW(F$12),0)","v":3}]
[{"$f":"OFFSET(PO!J$12,ROW(A283)-ROW($A$12),0)","v":"Serviço"},{"$f":"IF($A283=0,\"\",OFFSET(PO!K$12,ROW(B283)-ROW(B$12),0))","v":"17.0.15."},{"$f":"IF(OFFSET(PO!N$12,ROW(C283)-ROW(C$12),0)=0,\"\",OFFSET(PO!N$12,ROW(C283)-ROW(C$12),0))","v":"TOMADA BAIXA DE EMBUTIR (3 MÓDULOS: 1 RJ 45, 2 CEGOS ), DETALHE 2, INCLUINDO SUPORTE E PLACA - FORNECIMENTO E INSTALAÇÃO."},{"$f":"IF(OFFSET(PO!O$12,ROW(D283)-ROW(D$12),0)=0,\"\",OFFSET(PO!O$12,ROW(D283)-ROW(D$12),0))","v":"UN"},{"$f":"IF($A283<>\"Serviço\",0,ROUND(SUMIF($F$9:$P$9,\"<>\",$F283:$P283),15-13*PO!$X$3))","v":1},{"$f":"OFFSET(PO!$P$12,ROW($E283)-ROW(F$12),0)","v":1}]
[{"$f":"OFFSET(PO!J$12,ROW(A284)-ROW($A$12),0)","v":"Serviço"},{"$f":"IF($A284=0,\"\",OFFSET(PO!K$12,ROW(B284)-ROW(B$12),0))","v":"17.0.16."},{"$f":"IF(OFFSET(PO!N$12,ROW(C284)-ROW(C$12),0)=0,\"\",OFFSET(PO!N$12,ROW(C284)-ROW(C$12),0))","v":"TOMADA BAIXA DE EMBUTIR 4\"X4\" (6 MÓDULOS: 2 RJ 45, 2 RJ 11, 2 CEGOS ), DETALHE 5, INCLUINDO SUPORTE E PLACA - FORNECIMENTO E INSTALAÇÃO."},{"$f":"IF(OFFSET(PO!O$12,ROW(D284)-ROW(D$12),0)=0,\"\",OFFSET(PO!O$12,ROW(D284)-ROW(D$12),0))","v":"UN"},{"$f":"IF($A284<>\"Serviço\",0,ROUND(SUMIF($F$9:$P$9,\"<>\",$F284:$P284),15-13*PO!$X$3))","v":1},{"$f":"OFFSET(PO!$P$12,ROW($E284)-ROW(F$12),0)","v":1}]
[{"$f":"OFFSET(PO!J$12,ROW(A285)-ROW($A$12),0)","v":"Serviço"},{"$f":"IF($A285=0,\"\",OFFSET(PO!K$12,ROW(B285)-ROW(B$12),0))","v":"17.0.17."},{"$f":"IF(OFFSET(PO!N$12,ROW(C285)-ROW(C$12),0)=0,\"\",OFFSET(PO!N$12,ROW(C285)-ROW(C$12),0))","v":"TOMADA MÉDIA DE EMBUTIR (3 MÓDULOS: 1 RJ 45, 2 CEGOS ), DETALHE 2, INCLUINDO SUPORTE E PLACA - FORNECIMENTO E INSTALAÇÃO."},{"$f":"IF(OFFSET(PO!O$12,ROW(D285)-ROW(D$12),0)=0,\"\",OFFSET(PO!O$12,ROW(D285)-ROW(D$12),0))","v":"UN"},{"$f":"IF($A285<>\"Serviço\",0,ROUND(SUMIF($F$9:$P$9,\"<>\",$F285:$P285),15-13*PO!$X$3))","v":1},{"$f":"OFFSET(PO!$P$12,ROW($E285)-ROW(F$12),0)","v":1}]
[{"$f":"OFFSET(PO!J$12,ROW(A286)-ROW($A$12),0)","v":"Serviço"},{"$f":"IF($A286=0,\"\",OFFSET(PO!K$12,ROW(B286)-ROW(B$12),0))","v":"17.0.18."},{"$f":"IF(OFFSET(PO!N$12,ROW(C286)-ROW(C$12),0)=0,\"\",OFFSET(PO!N$12,ROW(C286)-ROW(C$12),0))","v":"TOMADA ALTA DE EMBUTIR (3 MÓDULOS: 1 RJ 45, 2 CEGOS ), DETALHE 2, INCLUINDO SUPORTE E PLACA - FORNECIMENTO E INSTALAÇÃO."},{"$f":"IF(OFFSET(PO!O$12,ROW(D286)-ROW(D$12),0)=0,\"\",OFFSET(PO!O$12,ROW(D286)-ROW(D$12),0))","v":"UN"},{"$f":"IF($A286<>\"Serviço\",0,ROUND(SUMIF($F$9:$P$9,\"<>\",$F286:$P286),15-13*PO!$X$3))","v":1},{"$f":"OFFSET(PO!$P$12,ROW($E286)-ROW(F$12),0)","v":1}]
[{"$f":"OFFSET(PO!J$12,ROW(A287)-ROW($A$12),0)","v":"Serviço"},{"$f":"IF($A287=0,\"\",OFFSET(PO!K$12,ROW(B287)-ROW(B$12),0))","v":"17.0.19."},{"$f":"IF(OFFSET(PO!N$12,ROW(C287)-ROW(C$12),0)=0,\"\",OFFSET(PO!N$12,ROW(C287)-ROW(C$12),0))","v":"TOMADA ALTA DE EMBUTIR (3 MÓDULOS: 1 RJ 45, 2 COAXIAL), DETALHE 4, INCLUINDO SUPORTE E PLACA - FORNECIMENTO E INSTALAÇÃO."},{"$f":"IF(OFFSET(PO!O$12,ROW(D287)-ROW(D$12),0)=0,\"\",OFFSET(PO!O$12,ROW(D287)-ROW(D$12),0))","v":"UN"},{"$f":"IF($A287<>\"Serviço\",0,ROUND(SUMIF($F$9:$P$9,\"<>\",$F287:$P287),15-13*PO!$X$3))","v":2},{"$f":"OFFSET(PO!$P$12,ROW($E287)-ROW(F$12),0)","v":2}]
[{"$f":"OFFSET(PO!J$12,ROW(A288)-ROW($A$12),0)","v":"Serviço"},{"$f":"IF($A288=0,\"\",OFFSET(PO!K$12,ROW(B288)-ROW(B$12),0))","v":"17.0.20."},{"$f":"IF(OFFSET(PO!N$12,ROW(C288)-ROW(C$12),0)=0,\"\",OFFSET(PO!N$12,ROW(C288)-ROW(C$12),0))","v":"SENSOR DE PRESENÇA INFRAVERMELHO, COM FIO, PARA ALARME, FIXAÇÃO EM PAREDE, ABERTURA MÍNIMA 115°, ALCANCE MÍNIMO 12 M, COM FIXAÇÃO - FORNECIMENTO E INSTALAÇÃO."},{"$f":"IF(OFFSET(PO!O$12,ROW(D288)-ROW(D$12),0)=0,\"\",OFFSET(PO!O$12,ROW(D288)-ROW(D$12),0))","v":"UN"},{"$f":"IF($A288<>\"Serviço\",0,ROUND(SUMIF($F$9:$P$9,\"<>\",$F288:$P288),15-13*PO!$X$3))","v":14},{"$f":"OFFSET(PO!$P$12,ROW($E288)-ROW(F$12),0)","v":14}]
[{"$f":"OFFSET(PO!J$12,ROW(A289)-ROW($A$12),0)","v":"Serviço"},{"$f":"IF($A289=0,\"\",OFFSET(PO!K$12,ROW(B289)-ROW(B$12),0))","v":"17.0.21."},{"$f":"IF(OFFSET(PO!N$12,ROW(C289)-ROW(C$12),0)=0,\"\",OFFSET(PO!N$12,ROW(C289)-ROW(C$12),0))","v":"KIT CENTRAL DE ALARME MONITORADA COMPLETA (1 CENTRAL DE ALARME,  2 BATERIAS SELADAS 12V/7A, 2 MÓDULOS RECEPTOR TECLADO, 1 INTERFACE ETHERNET, 2 SIRENES PIEZOELÉTRICAS, 1 TECLADO LCD AVULSO, 1 FONTE DE ALIMENTAÇÃO) - FORNECIMENTO E INSTALAÇÃO"},{"$f":"IF(OFFSET(PO!O$12,ROW(D289)-ROW(D$12),0)=0,\"\",OFFSET(PO!O$12,ROW(D289)-ROW(D$12),0))","v":"UN"},{"$f":"IF($A289<>\"Serviço\",0,ROUND(SUMIF($F$9:$P$9,\"<>\",$F289:$P289),15-13*PO!$X$3))","v":1},{"$f":"OFFSET(PO!$P$12,ROW($E289)-ROW(F$12),0)","v":1}]
[{"$f":"OFFSET(PO!J$12,ROW(A290)-ROW($A$12),0)","v":"Serviço"},{"$f":"IF($A290=0,\"\",OFFSET(PO!K$12,ROW(B290)-ROW(B$12),0))","v":"17.0.22."},{"$f":"IF(OFFSET(PO!N$12,ROW(C290)-ROW(C$12),0)=0,\"\",OFFSET(PO!N$12,ROW(C290)-ROW(C$12),0))","v":"ELETROCALHA PERFURADA EM AÇO GALVANIZADO, LARGURA 100MM E ALTURA 50MM, COM TAMPA DE ENCAIXE, INCLUSIVE EMENDA, TERMINAIS E FIXAÇÃO - FORNECIMENTO E INSTALAÇÃO"},{"$f":"IF(OFFSET(PO!O$12,ROW(D290)-ROW(D$12),0)=0,\"\",OFFSET(PO!O$12,ROW(D290)-ROW(D$12),0))","v":"M"},{"$f":"IF($A290<>\"Serviço\",0,ROUND(SUMIF($F$9:$P$9,\"<>\",$F290:$P290),15-13*PO!$X$3))","v":3.5},{"$f":"OFFSET(PO!$P$12,ROW($E290)-ROW(F$12),0)","v":3.5}]
[{"$f":"OFFSET(PO!J$12,ROW(A291)-ROW($A$12),0)","v":"Serviço"},{"$f":"IF($A291=0,\"\",OFFSET(PO!K$12,ROW(B291)-ROW(B$12),0))","v":"17.0.23."},{"$f":"IF(OFFSET(PO!N$12,ROW(C291)-ROW(C$12),0)=0,\"\",OFFSET(PO!N$12,ROW(C291)-ROW(C$12),0))","v":"QUADRO DE DISTRIBUICAO PARA TELEFONE N.3, 40X40X12CM EM CHAPA METALICA, DE EMBUTIR, SEM ACESSORIOS, PADRAO TELEBRAS, FORNECIMENTO E INSTALACAO"},{"$f":"IF(OFFSET(PO!O$12,ROW(D291)-ROW(D$12),0)=0,\"\",OFFSET(PO!O$12,ROW(D291)-ROW(D$12),0))","v":"UN"},{"$f":"IF($A291<>\"Serviço\",0,ROUND(SUMIF($F$9:$P$9,\"<>\",$F291:$P291),15-13*PO!$X$3))","v":1},{"$f":"OFFSET(PO!$P$12,ROW($E291)-ROW(F$12),0)","v":1}]
[{"$f":"OFFSET(PO!J$12,ROW(A292)-ROW($A$12),0)","v":"Serviço"},{"$f":"IF($A292=0,\"\",OFFSET(PO!K$12,ROW(B292)-ROW(B$12),0))","v":"17.0.24."},{"$f":"IF(OFFSET(PO!N$12,ROW(C292)-ROW(C$12),0)=0,\"\",OFFSET(PO!N$12,ROW(C292)-ROW(C$12),0))","v":"ELETRODUTO RÍGIDO ROSCÁVEL, PVC, DN 50 MM (1 1/2\") - FORNECIMENTO E INSTALAÇÃO. AF_12/2015"},{"$f":"IF(OFFSET(PO!O$12,ROW(D292)-ROW(D$12),0)=0,\"\",OFFSET(PO!O$12,ROW(D292)-ROW(D$12),0))","v":"M"},{"$f":"IF($A292<>\"Serviço\",0,ROUND(SUMIF($F$9:$P$9,\"<>\",$F292:$P292),15-13*PO!$X$3))","v":20},{"$f":"OFFSET(PO!$P$12,ROW($E292)-ROW(F$12),0)","v":20}]
[{"$f":"OFFSET(PO!J$12,ROW(A293)-ROW($A$12),0)","v":"Serviço"},{"$f":"IF($A293=0,\"\",OFFSET(PO!K$12,ROW(B293)-ROW(B$12),0))","v":"17.0.25."},{"$f":"IF(OFFSET(PO!N$12,ROW(C293)-ROW(C$12),0)=0,\"\",OFFSET(PO!N$12,ROW(C293)-ROW(C$12),0))","v":"CABO TELEFÔNICO CTP-APL-50 10 PARES INSTALADO EM ENTRADA DE EDIFICAÇÃO - FORNECIMENTO E INSTALAÇÃO. AF_04/2018"},{"$f":"IF(OFFSET(PO!O$12,ROW(D293)-ROW(D$12),0)=0,\"\",OFFSET(PO!O$12,ROW(D293)-ROW(D$12),0))","v":"M"},{"$f":"IF($A293<>\"Serviço\",0,ROUND(SUMIF($F$9:$P$9,\"<>\",$F293:$P293),15-13*PO!$X$3))","v":20},{"$f":"OFFSET(PO!$P$12,ROW($E293)-ROW(F$12),0)","v":20}]
[{"$f":"OFFSET(PO!J$12,ROW(A294)-ROW($A$12),0)","v":"Serviço"},{"$f":"IF($A294=0,\"\",OFFSET(PO!K$12,ROW(B294)-ROW(B$12),0))","v":"17.0.26."},{"$f":"IF(OFFSET(PO!N$12,ROW(C294)-ROW(C$12),0)=0,\"\",OFFSET(PO!N$12,ROW(C294)-ROW(C$12),0))","v":"RACK DE PAREDE 19\" 8U 570 mm, COM PORTA DE VIDRO E CHAVES, RÉGUA COM 8 TOMADAS 20 A - FORNECIMENTO E INSTALAÇÃO"},{"$f":"IF(OFFSET(PO!O$12,ROW(D294)-ROW(D$12),0)=0,\"\",OFFSET(PO!O$12,ROW(D294)-ROW(D$12),0))","v":"UN"},{"$f":"IF($A294<>\"Serviço\",0,ROUND(SUMIF($F$9:$P$9,\"<>\",$F294:$P294),15-13*PO!$X$3))","v":1},{"$f":"OFFSET(PO!$P$12,ROW($E294)-ROW(F$12),0)","v":1}]
[{"$f":"OFFSET(PO!J$12,ROW(A295)-ROW($A$12),0)","v":"Serviço"},{"$f":"IF($A295=0,\"\",OFFSET(PO!K$12,ROW(B295)-ROW(B$12),0))","v":"17.0.27."},{"$f":"IF(OFFSET(PO!N$12,ROW(C295)-ROW(C$12),0)=0,\"\",OFFSET(PO!N$12,ROW(C295)-ROW(C$12),0))","v":"PATCH PANEL 24 PORTAS, CATEGORIA 5E - FORNECIMENTO E INSTALAÇÃO. AF_03/2018"},{"$f":"IF(OFFSET(PO!O$12,ROW(D295)-ROW(D$12),0)=0,\"\",OFFSET(PO!O$12,ROW(D295)-ROW(D$12),0))","v":"UN"},{"$f":"IF($A295<>\"Serviço\",0,ROUND(SUMIF($F$9:$P$9,\"<>\",$F295:$P295),15-13*PO!$X$3))","v":1},{"$f":"OFFSET(PO!$P$12,ROW($E295)-ROW(F$12),0)","v":1}]
[{"$f":"OFFSET(PO!J$12,ROW(A296)-ROW($A$12),0)","v":"Serviço"},{"$f":"IF($A296=0,\"\",OFFSET(PO!K$12,ROW(B296)-ROW(B$12),0))","v":"17.0.28."},{"$f":"IF(OFFSET(PO!N$12,ROW(C296)-ROW(C$12),0)=0,\"\",OFFSET(PO!N$12,ROW(C296)-ROW(C$12),0))","v":"ALARME BANHEIRO PNE, EM CONFORMIDADE COM A NBR 9050/2015, COM ACIONADOR TIPO BOTEIRA SOCO E SIRENE AÚDIO VISUAL EM LED, COM PLACA FOTOLUMINESCENTE E BRAILE EM ALUMÍNIO, 220V"},{"$f":"IF(OFFSET(PO!O$12,ROW(D296)-ROW(D$12),0)=0,\"\",OFFSET(PO!O$12,ROW(D296)-ROW(D$12),0))","v":"UN"},{"$f":"IF($A296<>\"Serviço\",0,ROUND(SUMIF($F$9:$P$9,\"<>\",$F296:$P296),15-13*PO!$X$3))","v":2},{"$f":"OFFSET(PO!$P$12,ROW($E296)-ROW(F$12),0)","v":2}]
[{"$f":"OFFSET(PO!J$12,ROW(A297)-ROW($A$12),0)","v":"Meta"},{"$f":"IF($A297=0,\"\",OFFSET(PO!K$12,ROW(B297)-ROW(B$12),0))","v":"18."},{"$f":"IF(OFFSET(PO!N$12,ROW(C297)-ROW(C$12),0)=0,\"\",OFFSET(PO!N$12,ROW(C297)-ROW(C$12),0))","v":"LOUÇAS E METAIS"},{"$f":"IF(OFFSET(PO!O$12,ROW(D297)-ROW(D$12),0)=0,\"\",OFFSET(PO!O$12,ROW(D297)-ROW(D$12),0))","v":""},{"$f":"IF($A297<>\"Serviço\",0,ROUND(SUMIF($F$9:$P$9,\"<>\",$F297:$P297),15-13*PO!$X$3))","v":0},{"$f":"OFFSET(PO!$P$12,ROW($E297)-ROW(F$12),0)","v":0}]
[{"$f":"OFFSET(PO!J$12,ROW(A298)-ROW($A$12),0)","v":"Serviço"},{"$f":"IF($A298=0,\"\",OFFSET(PO!K$12,ROW(B298)-ROW(B$12),0))","v":"18.0.1."},{"$f":"IF(OFFSET(PO!N$12,ROW(C298)-ROW(C$12),0)=0,\"\",OFFSET(PO!N$12,ROW(C298)-ROW(C$12),0))","v":"VASO SANITÁRIO SIFONADO COM CAIXA ACOPLADA LOUÇA BRANCA - PADRÃO MÉDIO, INCLUSO ENGATE FLEXÍVEL EM METAL CROMADO, 1/2\u0094 X 40CM - FORNECIMENTO E INSTALAÇÃO. AF_12/2013"},{"$f":"IF(OFFSET(PO!O$12,ROW(D298)-ROW(D$12),0)=0,\"\",OFFSET(PO!O$12,ROW(D298)-ROW(D$12),0))","v":"UN"},{"$f":"IF($A298<>\"Serviço\",0,ROUND(SUMIF($F$9:$P$9,\"<>\",$F298:$P298),15-13*PO!$X$3))","v":4},{"$f":"OFFSET(PO!$P$12,ROW($E298)-ROW(F$12),0)","v":4}]
[{"$f":"OFFSET(PO!J$12,ROW(A299)-ROW($A$12),0)","v":"Serviço"},{"$f":"IF($A299=0,\"\",OFFSET(PO!K$12,ROW(B299)-ROW(B$12),0))","v":"18.0.2."},{"$f":"IF(OFFSET(PO!N$12,ROW(C299)-ROW(C$12),0)=0,\"\",OFFSET(PO!N$12,ROW(C299)-ROW(C$12),0))","v":"ASSENTO SANITARIO DE PLASTICO, TIPO CONVENCIONAL"},{"$f":"IF(OFFSET(PO!O$12,ROW(D299)-ROW(D$12),0)=0,\"\",OFFSET(PO!O$12,ROW(D299)-ROW(D$12),0))","v":"UN"},{"$f":"IF($A299<>\"Serviço\",0,ROUND(SUMIF($F$9:$P$9,\"<>\",$F299:$P299),15-13*PO!$X$3))","v":4},{"$f":"OFFSET(PO!$P$12,ROW($E299)-ROW(F$12),0)","v":4}]
[{"$f":"OFFSET(PO!J$12,ROW(A300)-ROW($A$12),0)","v":"Serviço"},{"$f":"IF($A300=0,\"\",OFFSET(PO!K$12,ROW(B300)-ROW(B$12),0))","v":"18.0.3."},{"$f":"IF(OFFSET(PO!N$12,ROW(C300)-ROW(C$12),0)=0,\"\",OFFSET(PO!N$12,ROW(C300)-ROW(C$12),0))","v":"LAVATORIO DE CANTO LOUCA BRANCA SUSPENSO *40 X 30* CM"},{"$f":"IF(OFFSET(PO!O$12,ROW(D300)-ROW(D$12),0)=0,\"\",OFFSET(PO!O$12,ROW(D300)-ROW(D$12),0))","v":"UN"},{"$f":"IF($A300<>\"Serviço\",0,ROUND(SUMIF($F$9:$P$9,\"<>\",$F300:$P300),15-13*PO!$X$3))","v":2},{"$f":"OFFSET(PO!$P$12,ROW($E300)-ROW(F$12),0)","v":2}]
[{"$f":"OFFSET(PO!J$12,ROW(A301)-ROW($A$12),0)","v":"Serviço"},{"$f":"IF($A301=0,\"\",OFFSET(PO!K$12,ROW(B301)-ROW(B$12),0))","v":"18.0.4."},{"$f":"IF(OFFSET(PO!N$12,ROW(C301)-ROW(C$12),0)=0,\"\",OFFSET(PO!N$12,ROW(C301)-ROW(C$12),0))","v":"CUBA DE EMBUTIR OVAL EM LOUÇA BRANCA, 35 X 50CM OU EQUIVALENTE, INCLUSO VÁLVULA E SIFÃO TIPO GARRAFA EM METAL CROMADO - FORNECIMENTO E INSTALAÇÃO. AF_12/2013"},{"$f":"IF(OFFSET(PO!O$12,ROW(D301)-ROW(D$12),0)=0,\"\",OFFSET(PO!O$12,ROW(D301)-ROW(D$12),0))","v":"UN"},{"$f":"IF($A301<>\"Serviço\",0,ROUND(SUMIF($F$9:$P$9,\"<>\",$F301:$P301),15-13*PO!$X$3))","v":2},{"$f":"OFFSET(PO!$P$12,ROW($E301)-ROW(F$12),0)","v":2}]
[{"$f":"OFFSET(PO!J$12,ROW(A302)-ROW($A$12),0)","v":"Serviço"},{"$f":"IF($A302=0,\"\",OFFSET(PO!K$12,ROW(B302)-ROW(B$12),0))","v":"18.0.5."},{"$f":"IF(OFFSET(PO!N$12,ROW(C302)-ROW(C$12),0)=0,\"\",OFFSET(PO!N$12,ROW(C302)-ROW(C$12),0))","v":"CUBA DE EMBUTIR DE AÇO INOXIDÁVEL MÉDIA, INCLUSO VÁLVULA TIPO AMERICANA E SIFÃO TIPO GARRAFA EM METAL CROMADO - FORNECIMENTO E INSTALAÇÃO. AF_12/2013"},{"$f":"IF(OFFSET(PO!O$12,ROW(D302)-ROW(D$12),0)=0,\"\",OFFSET(PO!O$12,ROW(D302)-ROW(D$12),0))","v":"UN"},{"$f":"IF($A302<>\"Serviço\",0,ROUND(SUMIF($F$9:$P$9,\"<>\",$F302:$P302),15-13*PO!$X$3))","v":1},{"$f":"OFFSET(PO!$P$12,ROW($E302)-ROW(F$12),0)","v":1}]
[{"$f":"OFFSET(PO!J$12,ROW(A303)-ROW($A$12),0)","v":"Serviço"},{"$f":"IF($A303=0,\"\",OFFSET(PO!K$12,ROW(B303)-ROW(B$12),0))","v":"18.0.6."},{"$f":"IF(OFFSET(PO!N$12,ROW(C303)-ROW(C$12),0)=0,\"\",OFFSET(PO!N$12,ROW(C303)-ROW(C$12),0))","v":"TANQUE DE LOUÇA BRANCA COM COLUNA, 30L OU EQUIVALENTE, INCLUSO SIFÃO FLEXÍVEL EM PVC, VÁLVULA METÁLICA E TORNEIRA DE METAL CROMADO PADRÃO MÉDIO - FORNECIMENTO E INSTALAÇÃO. AF_12/2013"},{"$f":"IF(OFFSET(PO!O$12,ROW(D303)-ROW(D$12),0)=0,\"\",OFFSET(PO!O$12,ROW(D303)-ROW(D$12),0))","v":"UN"},{"$f":"IF($A303<>\"Serviço\",0,ROUND(SUMIF($F$9:$P$9,\"<>\",$F303:$P303),15-13*PO!$X$3))","v":1},{"$f":"OFFSET(PO!$P$12,ROW($E303)-ROW(F$12),0)","v":1}]
[{"$f":"OFFSET(PO!J$12,ROW(A304)-ROW($A$12),0)","v":"Serviço"},{"$f":"IF($A304=0,\"\",OFFSET(PO!K$12,ROW(B304)-ROW(B$12),0))","v":"18.0.7."},{"$f":"IF(OFFSET(PO!N$12,ROW(C304)-ROW(C$12),0)=0,\"\",OFFSET(PO!N$12,ROW(C304)-ROW(C$12),0))","v":"SABONETEIRA PLASTICA TIPO DISPENSER PARA SABONETE LIQUIDO COM RESERVATORIO 800 A 1500 ML, INCLUSO FIXAÇÃO. AF_10/2016"},{"$f":"IF(OFFSET(PO!O$12,ROW(D304)-ROW(D$12),0)=0,\"\",OFFSET(PO!O$12,ROW(D304)-ROW(D$12),0))","v":"UN"},{"$f":"IF($A304<>\"Serviço\",0,ROUND(SUMIF($F$9:$P$9,\"<>\",$F304:$P304),15-13*PO!$X$3))","v":4},{"$f":"OFFSET(PO!$P$12,ROW($E304)-ROW(F$12),0)","v":4}]
[{"$f":"OFFSET(PO!J$12,ROW(A305)-ROW($A$12),0)","v":"Serviço"},{"$f":"IF($A305=0,\"\",OFFSET(PO!K$12,ROW(B305)-ROW(B$12),0))","v":"18.0.8."},{"$f":"IF(OFFSET(PO!N$12,ROW(C305)-ROW(C$12),0)=0,\"\",OFFSET(PO!N$12,ROW(C305)-ROW(C$12),0))","v":"REGISTRO DE GAVETA BRUTO, LATÃO, ROSCÁVEL, 3/4\", COM ACABAMENTO E CANOPLA CROMADOS. FORNECIDO E INSTALADO EM RAMAL DE ÁGUA. AF_12/2014"},{"$f":"IF(OFFSET(PO!O$12,ROW(D305)-ROW(D$12),0)=0,\"\",OFFSET(PO!O$12,ROW(D305)-ROW(D$12),0))","v":"UN"},{"$f":"IF($A305<>\"Serviço\",0,ROUND(SUMIF($F$9:$P$9,\"<>\",$F305:$P305),15-13*PO!$X$3))","v":4},{"$f":"OFFSET(PO!$P$12,ROW($E305)-ROW(F$12),0)","v":4}]
[{"$f":"OFFSET(PO!J$12,ROW(A306)-ROW($A$12),0)","v":"Serviço"},{"$f":"IF($A306=0,\"\",OFFSET(PO!K$12,ROW(B306)-ROW(B$12),0))","v":"18.0.9."},{"$f":"IF(OFFSET(PO!N$12,ROW(C306)-ROW(C$12),0)=0,\"\",OFFSET(PO!N$12,ROW(C306)-ROW(C$12),0))","v":"TORNEIRA CROMADA COM BICO PARA JARDIM/TANQUE 1/2 \" OU 3/4 \" (REF 1153)"},{"$f":"IF(OFFSET(PO!O$12,ROW(D306)-ROW(D$12),0)=0,\"\",OFFSET(PO!O$12,ROW(D306)-ROW(D$12),0))","v":"UN"},{"$f":"IF($A306<>\"Serviço\",0,ROUND(SUMIF($F$9:$P$9,\"<>\",$F306:$P306),15-13*PO!$X$3))","v":1},{"$f":"OFFSET(PO!$P$12,ROW($E306)-ROW(F$12),0)","v":1}]
[{"$f":"OFFSET(PO!J$12,ROW(A307)-ROW($A$12),0)","v":"Serviço"},{"$f":"IF($A307=0,\"\",OFFSET(PO!K$12,ROW(B307)-ROW(B$12),0))","v":"18.0.10."},{"$f":"IF(OFFSET(PO!N$12,ROW(C307)-ROW(C$12),0)=0,\"\",OFFSET(PO!N$12,ROW(C307)-ROW(C$12),0))","v":"TORNEIRA CROMADA TUBO MÓVEL, DE MESA, 1/2\" OU 3/4\", PARA PIA DE COZINHA, PADRÃO ALTO - FORNECIMENTO E INSTALAÇÃO. AF_12/2013"},{"$f":"IF(OFFSET(PO!O$12,ROW(D307)-ROW(D$12),0)=0,\"\",OFFSET(PO!O$12,ROW(D307)-ROW(D$12),0))","v":"UN"},{"$f":"IF($A307<>\"Serviço\",0,ROUND(SUMIF($F$9:$P$9,\"<>\",$F307:$P307),15-13*PO!$X$3))","v":1},{"$f":"OFFSET(PO!$P$12,ROW($E307)-ROW(F$12),0)","v":1}]
[{"$f":"OFFSET(PO!J$12,ROW(A308)-ROW($A$12),0)","v":"Serviço"},{"$f":"IF($A308=0,\"\",OFFSET(PO!K$12,ROW(B308)-ROW(B$12),0))","v":"18.0.11."},{"$f":"IF(OFFSET(PO!N$12,ROW(C308)-ROW(C$12),0)=0,\"\",OFFSET(PO!N$12,ROW(C308)-ROW(C$12),0))","v":"TORNEIRA CROMADA DE MESA PARA LAVATORIO TEMPORIZADA PRESSAO BICA BAIXA"},{"$f":"IF(OFFSET(PO!O$12,ROW(D308)-ROW(D$12),0)=0,\"\",OFFSET(PO!O$12,ROW(D308)-ROW(D$12),0))","v":"UN"},{"$f":"IF($A308<>\"Serviço\",0,ROUND(SUMIF($F$9:$P$9,\"<>\",$F308:$P308),15-13*PO!$X$3))","v":4},{"$f":"OFFSET(PO!$P$12,ROW($E308)-ROW(F$12),0)","v":4}]
[{"$f":"OFFSET(PO!J$12,ROW(A309)-ROW($A$12),0)","v":"Serviço"},{"$f":"IF($A309=0,\"\",OFFSET(PO!K$12,ROW(B309)-ROW(B$12),0))","v":"18.0.12."},{"$f":"IF(OFFSET(PO!N$12,ROW(C309)-ROW(C$12),0)=0,\"\",OFFSET(PO!N$12,ROW(C309)-ROW(C$12),0))","v":"SIFÃO DO TIPO GARRAFA EM METAL CROMADO 1 X 1.1/2\" - FORNECIMENTO E INSTALAÇÃO. AF_12/2013"},{"$f":"IF(OFFSET(PO!O$12,ROW(D309)-ROW(D$12),0)=0,\"\",OFFSET(PO!O$12,ROW(D309)-ROW(D$12),0))","v":"UN"},{"$f":"IF($A309<>\"Serviço\",0,ROUND(SUMIF($F$9:$P$9,\"<>\",$F309:$P309),15-13*PO!$X$3))","v":2},{"$f":"OFFSET(PO!$P$12,ROW($E309)-ROW(F$12),0)","v":2}]
[{"$f":"OFFSET(PO!J$12,ROW(A310)-ROW($A$12),0)","v":"Serviço"},{"$f":"IF($A310=0,\"\",OFFSET(PO!K$12,ROW(B310)-ROW(B$12),0))","v":"18.0.13."},{"$f":"IF(OFFSET(PO!N$12,ROW(C310)-ROW(C$12),0)=0,\"\",OFFSET(PO!N$12,ROW(C310)-ROW(C$12),0))","v":"VÁLVULA EM METAL CROMADO 1.1/2\" X 1.1/2\" PARA TANQUE OU LAVATÓRIO, COM OU SEM LADRÃO - FORNECIMENTO E INSTALAÇÃO. AF_12/2013"},{"$f":"IF(OFFSET(PO!O$12,ROW(D310)-ROW(D$12),0)=0,\"\",OFFSET(PO!O$12,ROW(D310)-ROW(D$12),0))","v":"UN"},{"$f":"IF($A310<>\"Serviço\",0,ROUND(SUMIF($F$9:$P$9,\"<>\",$F310:$P310),15-13*PO!$X$3))","v":2},{"$f":"OFFSET(PO!$P$12,ROW($E310)-ROW(F$12),0)","v":2}]
[{"$f":"OFFSET(PO!J$12,ROW(A311)-ROW($A$12),0)","v":"Serviço"},{"$f":"IF($A311=0,\"\",OFFSET(PO!K$12,ROW(B311)-ROW(B$12),0))","v":"18.0.14."},{"$f":"IF(OFFSET(PO!N$12,ROW(C311)-ROW(C$12),0)=0,\"\",OFFSET(PO!N$12,ROW(C311)-ROW(C$12),0))","v":"ENGATE FLEXÍVEL EM INOX, 1/2\u0094 X 40CM - FORNECIMENTO E INSTALAÇÃO. AF_12/2013"},{"$f":"IF(OFFSET(PO!O$12,ROW(D311)-ROW(D$12),0)=0,\"\",OFFSET(PO!O$12,ROW(D311)-ROW(D$12),0))","v":"UN"},{"$f":"IF($A311<>\"Serviço\",0,ROUND(SUMIF($F$9:$P$9,\"<>\",$F311:$P311),15-13*PO!$X$3))","v":6},{"$f":"OFFSET(PO!$P$12,ROW($E311)-ROW(F$12),0)","v":6}]
[{"$f":"OFFSET(PO!J$12,ROW(A312)-ROW($A$12),0)","v":"Serviço"},{"$f":"IF($A312=0,\"\",OFFSET(PO!K$12,ROW(B312)-ROW(B$12),0))","v":"18.0.15."},{"$f":"IF(OFFSET(PO!N$12,ROW(C312)-ROW(C$12),0)=0,\"\",OFFSET(PO!N$12,ROW(C312)-ROW(C$12),0))","v":"TOALHEIRO PLASTICO TIPO DISPENSER PARA PAPEL TOALHA INTERFOLHADO"},{"$f":"IF(OFFSET(PO!O$12,ROW(D312)-ROW(D$12),0)=0,\"\",OFFSET(PO!O$12,ROW(D312)-ROW(D$12),0))","v":"UN"},{"$f":"IF($A312<>\"Serviço\",0,ROUND(SUMIF($F$9:$P$9,\"<>\",$F312:$P312),15-13*PO!$X$3))","v":4},{"$f":"OFFSET(PO!$P$12,ROW($E312)-ROW(F$12),0)","v":4}]
[{"$f":"OFFSET(PO!J$12,ROW(A313)-ROW($A$12),0)","v":"Serviço"},{"$f":"IF($A313=0,\"\",OFFSET(PO!K$12,ROW(B313)-ROW(B$12),0))","v":"18.0.16."},{"$f":"IF(OFFSET(PO!N$12,ROW(C313)-ROW(C$12),0)=0,\"\",OFFSET(PO!N$12,ROW(C313)-ROW(C$12),0))","v":"BARRA DE APOIO LAVATORIO DE CANTO, EM ACO INOX POLIDO, DIAMETRO MINIMO 3 CM."},{"$f":"IF(OFFSET(PO!O$12,ROW(D313)-ROW(D$12),0)=0,\"\",OFFSET(PO!O$12,ROW(D313)-ROW(D$12),0))","v":"UN"},{"$f":"IF($A313<>\"Serviço\",0,ROUND(SUMIF($F$9:$P$9,\"<>\",$F313:$P313),15-13*PO!$X$3))","v":4},{"$f":"OFFSET(PO!$P$12,ROW($E313)-ROW(F$12),0)","v":4}]
[{"$f":"OFFSET(PO!J$12,ROW(A314)-ROW($A$12),0)","v":"Serviço"},{"$f":"IF($A314=0,\"\",OFFSET(PO!K$12,ROW(B314)-ROW(B$12),0))","v":"18.0.17."},{"$f":"IF(OFFSET(PO!N$12,ROW(C314)-ROW(C$12),0)=0,\"\",OFFSET(PO!N$12,ROW(C314)-ROW(C$12),0))","v":"BARRA DE APOIO RETA, EM ACO INOX POLIDO, COMPRIMENTO 90 CM, DIAMETRO MINIMO 3 CM"},{"$f":"IF(OFFSET(PO!O$12,ROW(D314)-ROW(D$12),0)=0,\"\",OFFSET(PO!O$12,ROW(D314)-ROW(D$12),0))","v":"UN"},{"$f":"IF($A314<>\"Serviço\",0,ROUND(SUMIF($F$9:$P$9,\"<>\",$F314:$P314),15-13*PO!$X$3))","v":4},{"$f":"OFFSET(PO!$P$12,ROW($E314)-ROW(F$12),0)","v":4}]
[{"$f":"OFFSET(PO!J$12,ROW(A315)-ROW($A$12),0)","v":"Serviço"},{"$f":"IF($A315=0,\"\",OFFSET(PO!K$12,ROW(B315)-ROW(B$12),0))","v":"18.0.18."},{"$f":"IF(OFFSET(PO!N$12,ROW(C315)-ROW(C$12),0)=0,\"\",OFFSET(PO!N$12,ROW(C315)-ROW(C$12),0))","v":"BARRA DE APOIO RETA, EM ACO INOX POLIDO, COMPRIMENTO 70CM, DIAMETRO MINIMO 3 CM"},{"$f":"IF(OFFSET(PO!O$12,ROW(D315)-ROW(D$12),0)=0,\"\",OFFSET(PO!O$12,ROW(D315)-ROW(D$12),0))","v":"UN"},{"$f":"IF($A315<>\"Serviço\",0,ROUND(SUMIF($F$9:$P$9,\"<>\",$F315:$P315),15-13*PO!$X$3))","v":2},{"$f":"OFFSET(PO!$P$12,ROW($E315)-ROW(F$12),0)","v":2}]
[{"$f":"OFFSET(PO!J$12,ROW(A316)-ROW($A$12),0)","v":"Serviço"},{"$f":"IF($A316=0,\"\",OFFSET(PO!K$12,ROW(B316)-ROW(B$12),0))","v":"18.0.19."},{"$f":"IF(OFFSET(PO!N$12,ROW(C316)-ROW(C$12),0)=0,\"\",OFFSET(PO!N$12,ROW(C316)-ROW(C$12),0))","v":"ESPELHO CRISTAL, ESPESSURA 4MM, COM PARAFUSOS DE FIXACAO, SEM MOLDURA"},{"$f":"IF(OFFSET(PO!O$12,ROW(D316)-ROW(D$12),0)=0,\"\",OFFSET(PO!O$12,ROW(D316)-ROW(D$12),0))","v":"M2"},{"$f":"IF($A316<>\"Serviço\",0,ROUND(SUMIF($F$9:$P$9,\"<>\",$F316:$P316),15-13*PO!$X$3))","v":3.8},{"$f":"OFFSET(PO!$P$12,ROW($E316)-ROW(F$12),0)","v":3.8}]
[{"$f":"OFFSET(PO!J$12,ROW(A317)-ROW($A$12),0)","v":"Serviço"},{"$f":"IF($A317=0,\"\",OFFSET(PO!K$12,ROW(B317)-ROW(B$12),0))","v":"18.0.20."},{"$f":"IF(OFFSET(PO!N$12,ROW(C317)-ROW(C$12),0)=0,\"\",OFFSET(PO!N$12,ROW(C317)-ROW(C$12),0))","v":"CORRIMAO EM TUBO ACO GALVANIZADO 2 1/2\" COM BRACADEIRA"},{"$f":"IF(OFFSET(PO!O$12,ROW(D317)-ROW(D$12),0)=0,\"\",OFFSET(PO!O$12,ROW(D317)-ROW(D$12),0))","v":"M"},{"$f":"IF($A317<>\"Serviço\",0,ROUND(SUMIF($F$9:$P$9,\"<>\",$F317:$P317),15-13*PO!$X$3))","v":9.6},{"$f":"OFFSET(PO!$P$12,ROW($E317)-ROW(F$12),0)","v":9.6}]
[{"$f":"OFFSET(PO!J$12,ROW(A318)-ROW($A$12),0)","v":"Serviço"},{"$f":"IF($A318=0,\"\",OFFSET(PO!K$12,ROW(B318)-ROW(B$12),0))","v":"18.0.21."},{"$f":"IF(OFFSET(PO!N$12,ROW(C318)-ROW(C$12),0)=0,\"\",OFFSET(PO!N$12,ROW(C318)-ROW(C$12),0))","v":"PAPELEIRA PLASTICA TIPO DISPENSER PARA PAPEL HIGIENICO ROLAO"},{"$f":"IF(OFFSET(PO!O$12,ROW(D318)-ROW(D$12),0)=0,\"\",OFFSET(PO!O$12,ROW(D318)-ROW(D$12),0))","v":"UN"},{"$f":"IF($A318<>\"Serviço\",0,ROUND(SUMIF($F$9:$P$9,\"<>\",$F318:$P318),15-13*PO!$X$3))","v":4},{"$f":"OFFSET(PO!$P$12,ROW($E318)-ROW(F$12),0)","v":4}]
[{"$f":"OFFSET(PO!J$12,ROW(A319)-ROW($A$12),0)","v":"Serviço"},{"$f":"IF($A319=0,\"\",OFFSET(PO!K$12,ROW(B319)-ROW(B$12),0))","v":"18.0.22."},{"$f":"IF(OFFSET(PO!N$12,ROW(C319)-ROW(C$12),0)=0,\"\",OFFSET(PO!N$12,ROW(C319)-ROW(C$12),0))","v":"FIXAÇÃO UTILIZANDO PARAFUSO E BUCHA DE NYLON, SOMENTE MÃO DE OBRA. AF_10/2016"},{"$f":"IF(OFFSET(PO!O$12,ROW(D319)-ROW(D$12),0)=0,\"\",OFFSET(PO!O$12,ROW(D319)-ROW(D$12),0))","v":"UN"},{"$f":"IF($A319<>\"Serviço\",0,ROUND(SUMIF($F$9:$P$9,\"<>\",$F319:$P319),15-13*PO!$X$3))","v":8},{"$f":"OFFSET(PO!$P$12,ROW($E319)-ROW(F$12),0)","v":8}]
[{"$f":"OFFSET(PO!J$12,ROW(A320)-ROW($A$12),0)","v":"Serviço"},{"$f":"IF($A320=0,\"\",OFFSET(PO!K$12,ROW(B320)-ROW(B$12),0))","v":"18.0.23."},{"$f":"IF(OFFSET(PO!N$12,ROW(C320)-ROW(C$12),0)=0,\"\",OFFSET(PO!N$12,ROW(C320)-ROW(C$12),0))","v":"CABIDE/GANCHO DE BANHEIRO SIMPLES EM METAL CROMADO"},{"$f":"IF(OFFSET(PO!O$12,ROW(D320)-ROW(D$12),0)=0,\"\",OFFSET(PO!O$12,ROW(D320)-ROW(D$12),0))","v":"UN"},{"$f":"IF($A320<>\"Serviço\",0,ROUND(SUMIF($F$9:$P$9,\"<>\",$F320:$P320),15-13*PO!$X$3))","v":2},{"$f":"OFFSET(PO!$P$12,ROW($E320)-ROW(F$12),0)","v":2}]
[{"$f":"OFFSET(PO!J$12,ROW(A321)-ROW($A$12),0)","v":"Meta"},{"$f":"IF($A321=0,\"\",OFFSET(PO!K$12,ROW(B321)-ROW(B$12),0))","v":"19."},{"$f":"IF(OFFSET(PO!N$12,ROW(C321)-ROW(C$12),0)=0,\"\",OFFSET(PO!N$12,ROW(C321)-ROW(C$12),0))","v":"INSTALAÇÕES DE GÁS - GLP"},{"$f":"IF(OFFSET(PO!O$12,ROW(D321)-ROW(D$12),0)=0,\"\",OFFSET(PO!O$12,ROW(D321)-ROW(D$12),0))","v":""},{"$f":"IF($A321<>\"Serviço\",0,ROUND(SUMIF($F$9:$P$9,\"<>\",$F321:$P321),15-13*PO!$X$3))","v":0},{"$f":"OFFSET(PO!$P$12,ROW($E321)-ROW(F$12),0)","v":0}]
[{"$f":"OFFSET(PO!J$12,ROW(A322)-ROW($A$12),0)","v":"Serviço"},{"$f":"IF($A322=0,\"\",OFFSET(PO!K$12,ROW(B322)-ROW(B$12),0))","v":"19.0.1."},{"$f":"IF(OFFSET(PO!N$12,ROW(C322)-ROW(C$12),0)=0,\"\",OFFSET(PO!N$12,ROW(C322)-ROW(C$12),0))","v":"TUBO DE AÇO GALVANIZADO COM COSTURA, CLASSE MÉDIA, CONEXÃO ROSQUEADA, DN 20 (3/4\"), INSTALADO EM RAMAIS E SUB-RAMAIS DE GÁS - FORNECIMENTO E INSTALAÇÃO. AF_12/2015"},{"$f":"IF(OFFSET(PO!O$12,ROW(D322)-ROW(D$12),0)=0,\"\",OFFSET(PO!O$12,ROW(D322)-ROW(D$12),0))","v":"M"},{"$f":"IF($A322<>\"Serviço\",0,ROUND(SUMIF($F$9:$P$9,\"<>\",$F322:$P322),15-13*PO!$X$3))","v":15},{"$f":"OFFSET(PO!$P$12,ROW($E322)-ROW(F$12),0)","v":15}]
[{"$f":"OFFSET(PO!J$12,ROW(A323)-ROW($A$12),0)","v":"Serviço"},{"$f":"IF($A323=0,\"\",OFFSET(PO!K$12,ROW(B323)-ROW(B$12),0))","v":"19.0.2."},{"$f":"IF(OFFSET(PO!N$12,ROW(C323)-ROW(C$12),0)=0,\"\",OFFSET(PO!N$12,ROW(C323)-ROW(C$12),0))","v":"FITA ADESIVA ANTICORROSIVA DE PVC FLEXIVEL, COR PRETA, PARA PROTECAO TUBULACAO, 50 MM X 30 M (L X C), E= *0,25* MM"},{"$f":"IF(OFFSET(PO!O$12,ROW(D323)-ROW(D$12),0)=0,\"\",OFFSET(PO!O$12,ROW(D323)-ROW(D$12),0))","v":"M"},{"$f":"IF($A323<>\"Serviço\",0,ROUND(SUMIF($F$9:$P$9,\"<>\",$F323:$P323),15-13*PO!$X$3))","v":55.4},{"$f":"OFFSET(PO!$P$12,ROW($E323)-ROW(F$12),0)","v":55.4}]
[{"$f":"OFFSET(PO!J$12,ROW(A324)-ROW($A$12),0)","v":"Serviço"},{"$f":"IF($A324=0,\"\",OFFSET(PO!K$12,ROW(B324)-ROW(B$12),0))","v":"19.0.3."},{"$f":"IF(OFFSET(PO!N$12,ROW(C324)-ROW(C$12),0)=0,\"\",OFFSET(PO!N$12,ROW(C324)-ROW(C$12),0))","v":"JOELHO 45 GRAUS, EM FERRO GALVANIZADO, CONEXÃO ROSQUEADA, DN 20 (3/4\"), INSTALADO EM RAMAIS E SUB-RAMAIS DE GÁS - FORNECIMENTO E INSTALAÇÃO. AF_12/2015"},{"$f":"IF(OFFSET(PO!O$12,ROW(D324)-ROW(D$12),0)=0,\"\",OFFSET(PO!O$12,ROW(D324)-ROW(D$12),0))","v":"UN"},{"$f":"IF($A324<>\"Serviço\",0,ROUND(SUMIF($F$9:$P$9,\"<>\",$F324:$P324),15-13*PO!$X$3))","v":1},{"$f":"OFFSET(PO!$P$12,ROW($E324)-ROW(F$12),0)","v":1}]
[{"$f":"OFFSET(PO!J$12,ROW(A325)-ROW($A$12),0)","v":"Serviço"},{"$f":"IF($A325=0,\"\",OFFSET(PO!K$12,ROW(B325)-ROW(B$12),0))","v":"19.0.4."},{"$f":"IF(OFFSET(PO!N$12,ROW(C325)-ROW(C$12),0)=0,\"\",OFFSET(PO!N$12,ROW(C325)-ROW(C$12),0))","v":"JOELHO 90 GRAUS, EM FERRO GALVANIZADO, CONEXÃO ROSQUEADA, DN 20 (3/4\"), INSTALADO EM RAMAIS E SUB-RAMAIS DE GÁS - FORNECIMENTO E INSTALAÇÃO. AF_12/2015"},{"$f":"IF(OFFSET(PO!O$12,ROW(D325)-ROW(D$12),0)=0,\"\",OFFSET(PO!O$12,ROW(D325)-ROW(D$12),0))","v":"UN"},{"$f":"IF($A325<>\"Serviço\",0,ROUND(SUMIF($F$9:$P$9,\"<>\",$F325:$P325),15-13*PO!$X$3))","v":6},{"$f":"OFFSET(PO!$P$12,ROW($E325)-ROW(F$12),0)","v":6}]
[{"$f":"OFFSET(PO!J$12,ROW(A326)-ROW($A$12),0)","v":"Serviço"},{"$f":"IF($A326=0,\"\",OFFSET(PO!K$12,ROW(B326)-ROW(B$12),0))","v":"19.0.5."},{"$f":"IF(OFFSET(PO!N$12,ROW(C326)-ROW(C$12),0)=0,\"\",OFFSET(PO!N$12,ROW(C326)-ROW(C$12),0))","v":"MANGUEIRA PARA GAS - GLP, DIAMETRO DE 3/8\", COMPRIMENTO DE 1M"},{"$f":"IF(OFFSET(PO!O$12,ROW(D326)-ROW(D$12),0)=0,\"\",OFFSET(PO!O$12,ROW(D326)-ROW(D$12),0))","v":"UN"},{"$f":"IF($A326<>\"Serviço\",0,ROUND(SUMIF($F$9:$P$9,\"<>\",$F326:$P326),15-13*PO!$X$3))","v":1},{"$f":"OFFSET(PO!$P$12,ROW($E326)-ROW(F$12),0)","v":1}]
[{"$f":"OFFSET(PO!J$12,ROW(A327)-ROW($A$12),0)","v":"Serviço"},{"$f":"IF($A327=0,\"\",OFFSET(PO!K$12,ROW(B327)-ROW(B$12),0))","v":"19.0.6."},{"$f":"IF(OFFSET(PO!N$12,ROW(C327)-ROW(C$12),0)=0,\"\",OFFSET(PO!N$12,ROW(C327)-ROW(C$12),0))","v":"VALVULA DE ESFERA BRUTA EM BRONZE, BITOLA 1/2 \" (REF 1552-B)"},{"$f":"IF(OFFSET(PO!O$12,ROW(D327)-ROW(D$12),0)=0,\"\",OFFSET(PO!O$12,ROW(D327)-ROW(D$12),0))","v":"UN"},{"$f":"IF($A327<>\"Serviço\",0,ROUND(SUMIF($F$9:$P$9,\"<>\",$F327:$P327),15-13*PO!$X$3))","v":1},{"$f":"OFFSET(PO!$P$12,ROW($E327)-ROW(F$12),0)","v":1}]
[{"$f":"OFFSET(PO!J$12,ROW(A328)-ROW($A$12),0)","v":"Serviço"},{"$f":"IF($A328=0,\"\",OFFSET(PO!K$12,ROW(B328)-ROW(B$12),0))","v":"19.0.7."},{"$f":"IF(OFFSET(PO!N$12,ROW(C328)-ROW(C$12),0)=0,\"\",OFFSET(PO!N$12,ROW(C328)-ROW(C$12),0))","v":"KIT CENTRAL DE GÁS GLP PARA 2 BOTIJÕES P13 (COMPLETO), INCLUSO MANGOTES COM REGISTRO E BORBOLETA, REGULADOR, VÁLVULAS DE ESFERA E CONEXÕES"},{"$f":"IF(OFFSET(PO!O$12,ROW(D328)-ROW(D$12),0)=0,\"\",OFFSET(PO!O$12,ROW(D328)-ROW(D$12),0))","v":"UN"},{"$f":"IF($A328<>\"Serviço\",0,ROUND(SUMIF($F$9:$P$9,\"<>\",$F328:$P328),15-13*PO!$X$3))","v":1},{"$f":"OFFSET(PO!$P$12,ROW($E328)-ROW(F$12),0)","v":1}]
[{"$f":"OFFSET(PO!J$12,ROW(A329)-ROW($A$12),0)","v":"Serviço"},{"$f":"IF($A329=0,\"\",OFFSET(PO!K$12,ROW(B329)-ROW(B$12),0))","v":"19.0.8."},{"$f":"IF(OFFSET(PO!N$12,ROW(C329)-ROW(C$12),0)=0,\"\",OFFSET(PO!N$12,ROW(C329)-ROW(C$12),0))","v":"PLACA DE SINALIZACAO DE SEGURANCA CONTRA INCENDIO, FOTOLUMINESCENTE, RETANGULAR, *20 X 40* CM, EM PVC *2* MM ANTI-CHAMAS (SIMBOLOS, CORES E PICTOGRAMAS CONFORME NBR 13434)"},{"$f":"IF(OFFSET(PO!O$12,ROW(D329)-ROW(D$12),0)=0,\"\",OFFSET(PO!O$12,ROW(D329)-ROW(D$12),0))","v":"UN"},{"$f":"IF($A329<>\"Serviço\",0,ROUND(SUMIF($F$9:$P$9,\"<>\",$F329:$P329),15-13*PO!$X$3))","v":2},{"$f":"OFFSET(PO!$P$12,ROW($E329)-ROW(F$12),0)","v":2}]
[{"$f":"OFFSET(PO!J$12,ROW(A330)-ROW($A$12),0)","v":"Meta"},{"$f":"IF($A330=0,\"\",OFFSET(PO!K$12,ROW(B330)-ROW(B$12),0))","v":"20."},{"$f":"IF(OFFSET(PO!N$12,ROW(C330)-ROW(C$12),0)=0,\"\",OFFSET(PO!N$12,ROW(C330)-ROW(C$12),0))","v":"INSTALAÇÃO DE CLIMATIZAÇÃO"},{"$f":"IF(OFFSET(PO!O$12,ROW(D330)-ROW(D$12),0)=0,\"\",OFFSET(PO!O$12,ROW(D330)-ROW(D$12),0))","v":""},{"$f":"IF($A330<>\"Serviço\",0,ROUND(SUMIF($F$9:$P$9,\"<>\",$F330:$P330),15-13*PO!$X$3))","v":0},{"$f":"OFFSET(PO!$P$12,ROW($E330)-ROW(F$12),0)","v":0}]
[{"$f":"OFFSET(PO!J$12,ROW(A331)-ROW($A$12),0)","v":"Serviço"},{"$f":"IF($A331=0,\"\",OFFSET(PO!K$12,ROW(B331)-ROW(B$12),0))","v":"20.0.1."},{"$f":"IF(OFFSET(PO!N$12,ROW(C331)-ROW(C$12),0)=0,\"\",OFFSET(PO!N$12,ROW(C331)-ROW(C$12),0))","v":"TUBO, PVC, SOLDÁVEL, DN 25MM, INSTALADO EM DRENO DE AR-CONDICIONADO - FORNECIMENTO E INSTALAÇÃO. AF_12/2014"},{"$f":"IF(OFFSET(PO!O$12,ROW(D331)-ROW(D$12),0)=0,\"\",OFFSET(PO!O$12,ROW(D331)-ROW(D$12),0))","v":"M"},{"$f":"IF($A331<>\"Serviço\",0,ROUND(SUMIF($F$9:$P$9,\"<>\",$F331:$P331),15-13*PO!$X$3))","v":40.200000000000003},{"$f":"OFFSET(PO!$P$12,ROW($E331)-ROW(F$12),0)","v":40.200000000000003}]
[{"$f":"OFFSET(PO!J$12,ROW(A332)-ROW($A$12),0)","v":"Serviço"},{"$f":"IF($A332=0,\"\",OFFSET(PO!K$12,ROW(B332)-ROW(B$12),0))","v":"20.0.2."},{"$f":"IF(OFFSET(PO!N$12,ROW(C332)-ROW(C$12),0)=0,\"\",OFFSET(PO!N$12,ROW(C332)-ROW(C$12),0))","v":"JOELHO 90 GRAUS, PVC, SOLDÁVEL, DN 25MM, INSTALADO EM DRENO DE AR-CONDICIONADO - FORNECIMENTO E INSTALAÇÃO. AF_12/2014"},{"$f":"IF(OFFSET(PO!O$12,ROW(D332)-ROW(D$12),0)=0,\"\",OFFSET(PO!O$12,ROW(D332)-ROW(D$12),0))","v":"UN"},{"$f":"IF($A332<>\"Serviço\",0,ROUND(SUMIF($F$9:$P$9,\"<>\",$F332:$P332),15-13*PO!$X$3))","v":15},{"$f":"OFFSET(PO!$P$12,ROW($E332)-ROW(F$12),0)","v":15}]
[{"$f":"OFFSET(PO!J$12,ROW(A333)-ROW($A$12),0)","v":"Serviço"},{"$f":"IF($A333=0,\"\",OFFSET(PO!K$12,ROW(B333)-ROW(B$12),0))","v":"20.0.3."},{"$f":"IF(OFFSET(PO!N$12,ROW(C333)-ROW(C$12),0)=0,\"\",OFFSET(PO!N$12,ROW(C333)-ROW(C$12),0))","v":"CAIXA DE PASSAGEM PRÉ - INSTALAÇÃO PARA AR-CONDICIONADO ATÉ 30.000 BTU'S, EM POLIETILENO, INCLUSO TAMPA DE ACABAMENTO E CONEXÕES - FORNECIMENTO E INSTALAÇÃO"},{"$f":"IF(OFFSET(PO!O$12,ROW(D333)-ROW(D$12),0)=0,\"\",OFFSET(PO!O$12,ROW(D333)-ROW(D$12),0))","v":"UN"},{"$f":"IF($A333<>\"Serviço\",0,ROUND(SUMIF($F$9:$P$9,\"<>\",$F333:$P333),15-13*PO!$X$3))","v":7},{"$f":"OFFSET(PO!$P$12,ROW($E333)-ROW(F$12),0)","v":7}]
[{"$f":"OFFSET(PO!J$12,ROW(A334)-ROW($A$12),0)","v":"Serviço"},{"$f":"IF($A334=0,\"\",OFFSET(PO!K$12,ROW(B334)-ROW(B$12),0))","v":"20.0.4."},{"$f":"IF(OFFSET(PO!N$12,ROW(C334)-ROW(C$12),0)=0,\"\",OFFSET(PO!N$12,ROW(C334)-ROW(C$12),0))","v":"TUBULAÇÃO EM COBRE FLEXÍVEL (3/8\" E 5/8\" PARA 24.000 BTUS) PARA INTERLIGAÇÃO DE CONDESADOR AO EVAPORADOR, INCLUSIVE ISOLAMENTO TÉRMICO, FITA DE PVC, INTERLIGAÇÃO ELÉTRICA (CABO PP 4 X 1,5MM²), FIXAÇÕES E CONEXÕES - FORNECIMENTO E INSTALAÇÃO"},{"$f":"IF(OFFSET(PO!O$12,ROW(D334)-ROW(D$12),0)=0,\"\",OFFSET(PO!O$12,ROW(D334)-ROW(D$12),0))","v":"M"},{"$f":"IF($A334<>\"Serviço\",0,ROUND(SUMIF($F$9:$P$9,\"<>\",$F334:$P334),15-13*PO!$X$3))","v":7},{"$f":"OFFSET(PO!$P$12,ROW($E334)-ROW(F$12),0)","v":7}]
[{"$f":"OFFSET(PO!J$12,ROW(A335)-ROW($A$12),0)","v":"Serviço"},{"$f":"IF($A335=0,\"\",OFFSET(PO!K$12,ROW(B335)-ROW(B$12),0))","v":"20.0.5."},{"$f":"IF(OFFSET(PO!N$12,ROW(C335)-ROW(C$12),0)=0,\"\",OFFSET(PO!N$12,ROW(C335)-ROW(C$12),0))","v":"TUBULAÇÃO EM COBRE FLEXÍVEL (1/4\" E 1/2\" ATÉ 18.000 BTUS) PARA INTERLIGAÇÃO DE CONDESADOR AO EVAPORADOR, INCLUSIVE ISOLAMENTO TÉRMICO, FITA DE PVC, INTERLIGAÇÃO ELÉTRICA (CABO PP 4 X 1,5MM²), FIXAÇÕES E CONEXÕES - FORNECIMENTO E INSTALAÇÃO"},{"$f":"IF(OFFSET(PO!O$12,ROW(D335)-ROW(D$12),0)=0,\"\",OFFSET(PO!O$12,ROW(D335)-ROW(D$12),0))","v":"M"},{"$f":"IF($A335<>\"Serviço\",0,ROUND(SUMIF($F$9:$P$9,\"<>\",$F335:$P335),15-13*PO!$X$3))","v":4},{"$f":"OFFSET(PO!$P$12,ROW($E335)-ROW(F$12),0)","v":4}]
[{"$f":"OFFSET(PO!J$12,ROW(A336)-ROW($A$12),0)","v":"Meta"},{"$f":"IF($A336=0,\"\",OFFSET(PO!K$12,ROW(B336)-ROW(B$12),0))","v":"21."},{"$f":"IF(OFFSET(PO!N$12,ROW(C336)-ROW(C$12),0)=0,\"\",OFFSET(PO!N$12,ROW(C336)-ROW(C$12),0))","v":"SISTEMA DE PROTEÇÃO CONTRA INCÊNDIO"},{"$f":"IF(OFFSET(PO!O$12,ROW(D336)-ROW(D$12),0)=0,\"\",OFFSET(PO!O$12,ROW(D336)-ROW(D$12),0))","v":""},{"$f":"IF($A336<>\"Serviço\",0,ROUND(SUMIF($F$9:$P$9,\"<>\",$F336:$P336),15-13*PO!$X$3))","v":0},{"$f":"OFFSET(PO!$P$12,ROW($E336)-ROW(F$12),0)","v":0}]
[{"$f":"OFFSET(PO!J$12,ROW(A337)-ROW($A$12),0)","v":"Serviço"},{"$f":"IF($A337=0,\"\",OFFSET(PO!K$12,ROW(B337)-ROW(B$12),0))","v":"21.0.1."},{"$f":"IF(OFFSET(PO!N$12,ROW(C337)-ROW(C$12),0)=0,\"\",OFFSET(PO!N$12,ROW(C337)-ROW(C$12),0))","v":"EXTINTOR INCENDIO TP PO QUIMICO 6KG - FORNECIMENTO E INSTALACAO"},{"$f":"IF(OFFSET(PO!O$12,ROW(D337)-ROW(D$12),0)=0,\"\",OFFSET(PO!O$12,ROW(D337)-ROW(D$12),0))","v":"UN"},{"$f":"IF($A337<>\"Serviço\",0,ROUND(SUMIF($F$9:$P$9,\"<>\",$F337:$P337),15-13*PO!$X$3))","v":2},{"$f":"OFFSET(PO!$P$12,ROW($E337)-ROW(F$12),0)","v":2}]
[{"$f":"OFFSET(PO!J$12,ROW(A338)-ROW($A$12),0)","v":"Serviço"},{"$f":"IF($A338=0,\"\",OFFSET(PO!K$12,ROW(B338)-ROW(B$12),0))","v":"21.0.2."},{"$f":"IF(OFFSET(PO!N$12,ROW(C338)-ROW(C$12),0)=0,\"\",OFFSET(PO!N$12,ROW(C338)-ROW(C$12),0))","v":"LUMINÁRIA DE EMERGÊNCIA - FORNECIMENTO E INSTALAÇÃO. AF_11/2017"},{"$f":"IF(OFFSET(PO!O$12,ROW(D338)-ROW(D$12),0)=0,\"\",OFFSET(PO!O$12,ROW(D338)-ROW(D$12),0))","v":"UN"},{"$f":"IF($A338<>\"Serviço\",0,ROUND(SUMIF($F$9:$P$9,\"<>\",$F338:$P338),15-13*PO!$X$3))","v":6},{"$f":"OFFSET(PO!$P$12,ROW($E338)-ROW(F$12),0)","v":6}]
[{"$f":"OFFSET(PO!J$12,ROW(A339)-ROW($A$12),0)","v":"Serviço"},{"$f":"IF($A339=0,\"\",OFFSET(PO!K$12,ROW(B339)-ROW(B$12),0))","v":"21.0.3."},{"$f":"IF(OFFSET(PO!N$12,ROW(C339)-ROW(C$12),0)=0,\"\",OFFSET(PO!N$12,ROW(C339)-ROW(C$12),0))","v":"ABRIGO DE SOBREPOR PARA EXTINTOR 6KG, COM PINGADEIRA, 75 X 30 X 25 CM, CAIXA E PORTA FABRICADAS EM CHAPA DE AÇO COM TRATAMENTO ANTI-CORROSIVO E PINTURA ELETROSTÁTICA A PÓ NA COR VERMELHA, COM VENTILAÇÃO FRONTAL, DOBRADIÇAS, FECHO TIPO ENGATE RÁPIDO E VISOR EM ACRÍLICO - FORNECIMENTO E INSTALAÇÃO"},{"$f":"IF(OFFSET(PO!O$12,ROW(D339)-ROW(D$12),0)=0,\"\",OFFSET(PO!O$12,ROW(D339)-ROW(D$12),0))","v":"UN."},{"$f":"IF($A339<>\"Serviço\",0,ROUND(SUMIF($F$9:$P$9,\"<>\",$F339:$P339),15-13*PO!$X$3))","v":1},{"$f":"OFFSET(PO!$P$12,ROW($E339)-ROW(F$12),0)","v":1}]
[{"$f":"OFFSET(PO!J$12,ROW(A340)-ROW($A$12),0)","v":"Serviço"},{"$f":"IF($A340=0,\"\",OFFSET(PO!K$12,ROW(B340)-ROW(B$12),0))","v":"21.0.4."},{"$f":"IF(OFFSET(PO!N$12,ROW(C340)-ROW(C$12),0)=0,\"\",OFFSET(PO!N$12,ROW(C340)-ROW(C$12),0))","v":"PLACA DE SINALIZACAO DE SEGURANCA CONTRA INCENDIO, FOTOLUMINESCENTE, RETANGULAR, 15 X 30 CM, EM PVC 2 MM ANTI-CHAMAS (SIMBOLOS, CORES E PICTOGRAMAS CONFORME NBR 13434), FORNECIMENTO E INSTALAÇÃO"},{"$f":"IF(OFFSET(PO!O$12,ROW(D340)-ROW(D$12),0)=0,\"\",OFFSET(PO!O$12,ROW(D340)-ROW(D$12),0))","v":"UN"},{"$f":"IF($A340<>\"Serviço\",0,ROUND(SUMIF($F$9:$P$9,\"<>\",$F340:$P340),15-13*PO!$X$3))","v":4},{"$f":"OFFSET(PO!$P$12,ROW($E340)-ROW(F$12),0)","v":4}]
[{"$f":"OFFSET(PO!J$12,ROW(A341)-ROW($A$12),0)","v":"Serviço"},{"$f":"IF($A341=0,\"\",OFFSET(PO!K$12,ROW(B341)-ROW(B$12),0))","v":"21.0.5."},{"$f":"IF(OFFSET(PO!N$12,ROW(C341)-ROW(C$12),0)=0,\"\",OFFSET(PO!N$12,ROW(C341)-ROW(C$12),0))","v":"PLACA DE SINALIZACAO DE SEGURANCA CONTRA INCENDIO, FOTOLUMINESCENTE, QUADRADA, 30 X 30 CM, EM PVC 2 MM ANTI-CHAMAS (SIMBOLOS, CORES E PICTOGRAMAS CONFORME NBR 13434), FORNECIMENTO E INSTALAÇÃO"},{"$f":"IF(OFFSET(PO!O$12,ROW(D341)-ROW(D$12),0)=0,\"\",OFFSET(PO!O$12,ROW(D341)-ROW(D$12),0))","v":"UN"},{"$f":"IF($A341<>\"Serviço\",0,ROUND(SUMIF($F$9:$P$9,\"<>\",$F341:$P341),15-13*PO!$X$3))","v":3},{"$f":"OFFSET(PO!$P$12,ROW($E341)-ROW(F$12),0)","v":3}]
[{"$f":"OFFSET(PO!J$12,ROW(A342)-ROW($A$12),0)","v":"Serviço"},{"$f":"IF($A342=0,\"\",OFFSET(PO!K$12,ROW(B342)-ROW(B$12),0))","v":"21.0.6."},{"$f":"IF(OFFSET(PO!N$12,ROW(C342)-ROW(C$12),0)=0,\"\",OFFSET(PO!N$12,ROW(C342)-ROW(C$12),0))","v":"PLACA DE SINALIZACAO DE SEGURANCA CONTRA INCENDIO, FOTOLUMINESCENTE, QUADRADA, 15 X 15 CM, EM PVC 2 MM ANTI-CHAMAS (SIMBOLOS, CORES E PICTOGRAMAS CONFORME NBR 13434), FORNECIMENTO E INSTALAÇÃO"},{"$f":"IF(OFFSET(PO!O$12,ROW(D342)-ROW(D$12),0)=0,\"\",OFFSET(PO!O$12,ROW(D342)-ROW(D$12),0))","v":"UN"},{"$f":"IF($A342<>\"Serviço\",0,ROUND(SUMIF($F$9:$P$9,\"<>\",$F342:$P342),15-13*PO!$X$3))","v":3},{"$f":"OFFSET(PO!$P$12,ROW($E342)-ROW(F$12),0)","v":3}]
[{"$f":"OFFSET(PO!J$12,ROW(A343)-ROW($A$12),0)","v":"Serviço"},{"$f":"IF($A343=0,\"\",OFFSET(PO!K$12,ROW(B343)-ROW(B$12),0))","v":"21.0.7."},{"$f":"IF(OFFSET(PO!N$12,ROW(C343)-ROW(C$12),0)=0,\"\",OFFSET(PO!N$12,ROW(C343)-ROW(C$12),0))","v":"EXTINTOR DE INCENDIO PORTATIL COM CARGA DE PO QUIMICO SECO (PQS) DE 6 KG, CLASSE BC"},{"$f":"IF(OFFSET(PO!O$12,ROW(D343)-ROW(D$12),0)=0,\"\",OFFSET(PO!O$12,ROW(D343)-ROW(D$12),0))","v":"UN"},{"$f":"IF($A343<>\"Serviço\",0,ROUND(SUMIF($F$9:$P$9,\"<>\",$F343:$P343),15-13*PO!$X$3))","v":1},{"$f":"OFFSET(PO!$P$12,ROW($E343)-ROW(F$12),0)","v":1}]
[{"$f":"OFFSET(PO!J$12,ROW(A344)-ROW($A$12),0)","v":"Meta"},{"$f":"IF($A344=0,\"\",OFFSET(PO!K$12,ROW(B344)-ROW(B$12),0))","v":"22."},{"$f":"IF(OFFSET(PO!N$12,ROW(C344)-ROW(C$12),0)=0,\"\",OFFSET(PO!N$12,ROW(C344)-ROW(C$12),0))","v":"MURO"},{"$f":"IF(OFFSET(PO!O$12,ROW(D344)-ROW(D$12),0)=0,\"\",OFFSET(PO!O$12,ROW(D344)-ROW(D$12),0))","v":""},{"$f":"IF($A344<>\"Serviço\",0,ROUND(SUMIF($F$9:$P$9,\"<>\",$F344:$P344),15-13*PO!$X$3))","v":0},{"$f":"OFFSET(PO!$P$12,ROW($E344)-ROW(F$12),0)","v":0}]
[{"$f":"OFFSET(PO!J$12,ROW(A345)-ROW($A$12),0)","v":"Serviço"},{"$f":"IF($A345=0,\"\",OFFSET(PO!K$12,ROW(B345)-ROW(B$12),0))","v":"22.0.1."},{"$f":"IF(OFFSET(PO!N$12,ROW(C345)-ROW(C$12),0)=0,\"\",OFFSET(PO!N$12,ROW(C345)-ROW(C$12),0))","v":"CONCRETO CICLOPICO FCK=10MPA 30% PEDRA DE MAO INCLUSIVE LANCAMENTO"},{"$f":"IF(OFFSET(PO!O$12,ROW(D345)-ROW(D$12),0)=0,\"\",OFFSET(PO!O$12,ROW(D345)-ROW(D$12),0))","v":"M3"},{"$f":"IF($A345<>\"Serviço\",0,ROUND(SUMIF($F$9:$P$9,\"<>\",$F345:$P345),15-13*PO!$X$3))","v":3.37},{"$f":"OFFSET(PO!$P$12,ROW($E345)-ROW(F$12),0)","v":3.37}]
[{"$f":"OFFSET(PO!J$12,ROW(A346)-ROW($A$12),0)","v":"Serviço"},{"$f":"IF($A346=0,\"\",OFFSET(PO!K$12,ROW(B346)-ROW(B$12),0))","v":"22.0.2."},{"$f":"IF(OFFSET(PO!N$12,ROW(C346)-ROW(C$12),0)=0,\"\",OFFSET(PO!N$12,ROW(C346)-ROW(C$12),0))","v":"ALVENARIA EM TIJOLO CERAMICO MACICO 5X10X20CM 1 VEZ (ESPESSURA 20CM), ASSENTADO COM ARGAMASSA TRACO 1:2:8 (CIMENTO, CAL E AREIA)"},{"$f":"IF(OFFSET(PO!O$12,ROW(D346)-ROW(D$12),0)=0,\"\",OFFSET(PO!O$12,ROW(D346)-ROW(D$12),0))","v":"M2"},{"$f":"IF($A346<>\"Serviço\",0,ROUND(SUMIF($F$9:$P$9,\"<>\",$F346:$P346),15-13*PO!$X$3))","v":40.6},{"$f":"OFFSET(PO!$P$12,ROW($E346)-ROW(F$12),0)","v":40.6}]
[{"$f":"OFFSET(PO!J$12,ROW(A347)-ROW($A$12),0)","v":"Serviço"},{"$f":"IF($A347=0,\"\",OFFSET(PO!K$12,ROW(B347)-ROW(B$12),0))","v":"22.0.3."},{"$f":"IF(OFFSET(PO!N$12,ROW(C347)-ROW(C$12),0)=0,\"\",OFFSET(PO!N$12,ROW(C347)-ROW(C$12),0))","v":"CHAPISCO APLICADO EM ALVENARIA (SEM PRESENÇA DE VÃOS) E ESTRUTURAS DE CONCRETO DE FACHADA, COM COLHER DE PEDREIRO.  ARGAMASSA TRAÇO 1:3 COM PREPARO EM BETONEIRA 400L. AF_06/2014"},{"$f":"IF(OFFSET(PO!O$12,ROW(D347)-ROW(D$12),0)=0,\"\",OFFSET(PO!O$12,ROW(D347)-ROW(D$12),0))","v":"M2"},{"$f":"IF($A347<>\"Serviço\",0,ROUND(SUMIF($F$9:$P$9,\"<>\",$F347:$P347),15-13*PO!$X$3))","v":92.44},{"$f":"OFFSET(PO!$P$12,ROW($E347)-ROW(F$12),0)","v":92.44}]
[{"$f":"OFFSET(PO!J$12,ROW(A348)-ROW($A$12),0)","v":"Serviço"},{"$f":"IF($A348=0,\"\",OFFSET(PO!K$12,ROW(B348)-ROW(B$12),0))","v":"22.0.4."},{"$f":"IF(OFFSET(PO!N$12,ROW(C348)-ROW(C$12),0)=0,\"\",OFFSET(PO!N$12,ROW(C348)-ROW(C$12),0))","v":"MASSA ÚNICA, PARA RECEBIMENTO DE PINTURA, EM ARGAMASSA TRAÇO 1:2:8, PREPARO MECÂNICO COM BETONEIRA 400L, APLICADA MANUALMENTE EM FACES INTERNAS DE PAREDES, ESPESSURA DE 10MM, COM EXECUÇÃO DE TALISCAS. AF_06/2014"},{"$f":"IF(OFFSET(PO!O$12,ROW(D348)-ROW(D$12),0)=0,\"\",OFFSET(PO!O$12,ROW(D348)-ROW(D$12),0))","v":"M2"},{"$f":"IF($A348<>\"Serviço\",0,ROUND(SUMIF($F$9:$P$9,\"<>\",$F348:$P348),15-13*PO!$X$3))","v":92.44},{"$f":"OFFSET(PO!$P$12,ROW($E348)-ROW(F$12),0)","v":92.44}]
[{"$f":"OFFSET(PO!J$12,ROW(A349)-ROW($A$12),0)","v":"Serviço"},{"$f":"IF($A349=0,\"\",OFFSET(PO!K$12,ROW(B349)-ROW(B$12),0))","v":"22.0.5."},{"$f":"IF(OFFSET(PO!N$12,ROW(C349)-ROW(C$12),0)=0,\"\",OFFSET(PO!N$12,ROW(C349)-ROW(C$12),0))","v":"APLICAÇÃO DE FUNDO SELADOR ACRÍLICO EM PAREDES, UMA DEMÃO. AF_06/2014"},{"$f":"IF(OFFSET(PO!O$12,ROW(D349)-ROW(D$12),0)=0,\"\",OFFSET(PO!O$12,ROW(D349)-ROW(D$12),0))","v":"M2"},{"$f":"IF($A349<>\"Serviço\",0,ROUND(SUMIF($F$9:$P$9,\"<>\",$F349:$P349),15-13*PO!$X$3))","v":92.44},{"$f":"OFFSET(PO!$P$12,ROW($E349)-ROW(F$12),0)","v":92.44}]
[{"$f":"OFFSET(PO!J$12,ROW(A350)-ROW($A$12),0)","v":"Serviço"},{"$f":"IF($A350=0,\"\",OFFSET(PO!K$12,ROW(B350)-ROW(B$12),0))","v":"22.0.6."},{"$f":"IF(OFFSET(PO!N$12,ROW(C350)-ROW(C$12),0)=0,\"\",OFFSET(PO!N$12,ROW(C350)-ROW(C$12),0))","v":"APLICAÇÃO MANUAL DE PINTURA COM TINTA LÁTEX ACRÍLICA EM PAREDES, DUAS DEMÃOS. AF_06/2014"},{"$f":"IF(OFFSET(PO!O$12,ROW(D350)-ROW(D$12),0)=0,\"\",OFFSET(PO!O$12,ROW(D350)-ROW(D$12),0))","v":"M2"},{"$f":"IF($A350<>\"Serviço\",0,ROUND(SUMIF($F$9:$P$9,\"<>\",$F350:$P350),15-13*PO!$X$3))","v":92.44},{"$f":"OFFSET(PO!$P$12,ROW($E350)-ROW(F$12),0)","v":92.44}]
[{"$f":"OFFSET(PO!J$12,ROW(A351)-ROW($A$12),0)","v":"Serviço"},{"$f":"IF($A351=0,\"\",OFFSET(PO!K$12,ROW(B351)-ROW(B$12),0))","v":"22.0.7."},{"$f":"IF(OFFSET(PO!N$12,ROW(C351)-ROW(C$12),0)=0,\"\",OFFSET(PO!N$12,ROW(C351)-ROW(C$12),0))","v":"GRADIL MALHA MIN. 50X200MM, FIO 4,3MM, ALTURA 1,53 M, COM MONTANTES PARA CHUMBAR, FIXADOR DE NYLON (4/MONTANTE)"},{"$f":"IF(OFFSET(PO!O$12,ROW(D351)-ROW(D$12),0)=0,\"\",OFFSET(PO!O$12,ROW(D351)-ROW(D$12),0))","v":"M"},{"$f":"IF($A351<>\"Serviço\",0,ROUND(SUMIF($F$9:$P$9,\"<>\",$F351:$P351),15-13*PO!$X$3))","v":56.2},{"$f":"OFFSET(PO!$P$12,ROW($E351)-ROW(F$12),0)","v":56.2}]
[{"$f":"OFFSET(PO!J$12,ROW(A352)-ROW($A$12),0)","v":"Serviço"},{"$f":"IF($A352=0,\"\",OFFSET(PO!K$12,ROW(B352)-ROW(B$12),0))","v":"22.0.8."},{"$f":"IF(OFFSET(PO!N$12,ROW(C352)-ROW(C$12),0)=0,\"\",OFFSET(PO!N$12,ROW(C352)-ROW(C$12),0))","v":"PORTÃO PIVOTANTE 2 FOLHAS, COM 1,80 M E ALTURA 2,03 M, MALHA MÍN. 50 X 200MM, FIO 4.3MM, INCLUSO FECHADURA - COMPLETO"},{"$f":"IF(OFFSET(PO!O$12,ROW(D352)-ROW(D$12),0)=0,\"\",OFFSET(PO!O$12,ROW(D352)-ROW(D$12),0))","v":"M2"},{"$f":"IF($A352<>\"Serviço\",0,ROUND(SUMIF($F$9:$P$9,\"<>\",$F352:$P352),15-13*PO!$X$3))","v":3.65},{"$f":"OFFSET(PO!$P$12,ROW($E352)-ROW(F$12),0)","v":3.65}]
[{"$f":"OFFSET(PO!J$12,ROW(A353)-ROW($A$12),0)","v":"Serviço"},{"$f":"IF($A353=0,\"\",OFFSET(PO!K$12,ROW(B353)-ROW(B$12),0))","v":"22.0.9."},{"$f":"IF(OFFSET(PO!N$12,ROW(C353)-ROW(C$12),0)=0,\"\",OFFSET(PO!N$12,ROW(C353)-ROW(C$12),0))","v":"PORTÃO CORREDIÇO COM GRADIL, COM 3 M E ALTURA 2,03 M, MALHA MÍN. 50 X 200MM, FIO 4.3MM, INCLUSO TRILHOS, ROLDANAS - COMPLETO"},{"$f":"IF(OFFSET(PO!O$12,ROW(D353)-ROW(D$12),0)=0,\"\",OFFSET(PO!O$12,ROW(D353)-ROW(D$12),0))","v":"M2"},{"$f":"IF($A353<>\"Serviço\",0,ROUND(SUMIF($F$9:$P$9,\"<>\",$F353:$P353),15-13*PO!$X$3))","v":6.09},{"$f":"OFFSET(PO!$P$12,ROW($E353)-ROW(F$12),0)","v":6.09}]
[{"$f":"OFFSET(PO!J$12,ROW(A354)-ROW($A$12),0)","v":"Serviço"},{"$f":"IF($A354=0,\"\",OFFSET(PO!K$12,ROW(B354)-ROW(B$12),0))","v":"22.0.10."},{"$f":"IF(OFFSET(PO!N$12,ROW(C354)-ROW(C$12),0)=0,\"\",OFFSET(PO!N$12,ROW(C354)-ROW(C$12),0))","v":"MOVIMENTADOR DESLIZANTE PARA PORTÃO (MOTOR ELÉTRICO 1/2HP, MONOFÁSICO, 220V, COM CENTRAL DE COMANDO INCORPORADA E SISTEMA ANTI CLONAGEM, CAPACITOR, 2 CONTROLES REMOTOS, BARRAS DE CREMALHEIRA GALVANIZADAS, ÍMÃS E SENSORES DE FIM DE PERCURSO, 2 CHAVES PARA DESTRAVAMENTO EM CASO DE FALTA DE ENERGIA, CAPA PROTETORA DO MOTOR, FOTOCÉLULA COM SENSOR ANTI ESMAGAMENTO E COROA METÁLICA, SUPORTES - COMPLETO) - FORNECIMENTO E INSTALAÇÃO"},{"$f":"IF(OFFSET(PO!O$12,ROW(D354)-ROW(D$12),0)=0,\"\",OFFSET(PO!O$12,ROW(D354)-ROW(D$12),0))","v":"UN"},{"$f":"IF($A354<>\"Serviço\",0,ROUND(SUMIF($F$9:$P$9,\"<>\",$F354:$P354),15-13*PO!$X$3))","v":1},{"$f":"OFFSET(PO!$P$12,ROW($E354)-ROW(F$12),0)","v":1}]
[{"$f":"OFFSET(PO!J$12,ROW(A355)-ROW($A$12),0)","v":"Meta"},{"$f":"IF($A355=0,\"\",OFFSET(PO!K$12,ROW(B355)-ROW(B$12),0))","v":"23."},{"$f":"IF(OFFSET(PO!N$12,ROW(C355)-ROW(C$12),0)=0,\"\",OFFSET(PO!N$12,ROW(C355)-ROW(C$12),0))","v":"SERVIÇOS DIVERSOS"},{"$f":"IF(OFFSET(PO!O$12,ROW(D355)-ROW(D$12),0)=0,\"\",OFFSET(PO!O$12,ROW(D355)-ROW(D$12),0))","v":""},{"$f":"IF($A355<>\"Serviço\",0,ROUND(SUMIF($F$9:$P$9,\"<>\",$F355:$P355),15-13*PO!$X$3))","v":0},{"$f":"OFFSET(PO!$P$12,ROW($E355)-ROW(F$12),0)","v":0}]
[{"$f":"OFFSET(PO!J$12,ROW(A356)-ROW($A$12),0)","v":"Serviço"},{"$f":"IF($A356=0,\"\",OFFSET(PO!K$12,ROW(B356)-ROW(B$12),0))","v":"23.0.1."},{"$f":"IF(OFFSET(PO!N$12,ROW(C356)-ROW(C$12),0)=0,\"\",OFFSET(PO!N$12,ROW(C356)-ROW(C$12),0))","v":"MARQUISE COM COBERTURA EM POLICARBONATO ALVEOLAR VERDE 10 MM, 2,10M x 6,0M, E ESTRUTURA METÁLICA COM PINTURA, INCLUSIVE EMENDAS E ACABAMENTOS, FIXADA NA ALVENARIA COM PARABOLT - FORNECIMENTO E INSTALAÇÃO"},{"$f":"IF(OFFSET(PO!O$12,ROW(D356)-ROW(D$12),0)=0,\"\",OFFSET(PO!O$12,ROW(D356)-ROW(D$12),0))","v":"M²"},{"$f":"IF($A356<>\"Serviço\",0,ROUND(SUMIF($F$9:$P$9,\"<>\",$F356:$P356),15-13*PO!$X$3))","v":7.14},{"$f":"OFFSET(PO!$P$12,ROW($E356)-ROW(F$12),0)","v":7.14}]
[{"$f":"OFFSET(PO!J$12,ROW(A357)-ROW($A$12),0)","v":"Serviço"},{"$f":"IF($A357=0,\"\",OFFSET(PO!K$12,ROW(B357)-ROW(B$12),0))","v":"23.0.2."},{"$f":"IF(OFFSET(PO!N$12,ROW(C357)-ROW(C$12),0)=0,\"\",OFFSET(PO!N$12,ROW(C357)-ROW(C$12),0))","v":"PERGOLADO EM CONCRETO PRÉ-MOLDADO, COR AMADEIRADO, COM 4 PILARES 38,5 CM X 38,5 CM X 2,25 M, 4 CAPAS DE PILAR 50,5CM X 50,5CM X 12CM, 2 TERÇAS 10CM X 20CM X 5M, 7 CAIBROS 7CM X 10CM X 4M - FORNECIMENTO E INSTALAÇÃO"},{"$f":"IF(OFFSET(PO!O$12,ROW(D357)-ROW(D$12),0)=0,\"\",OFFSET(PO!O$12,ROW(D357)-ROW(D$12),0))","v":"UN"},{"$f":"IF($A357<>\"Serviço\",0,ROUND(SUMIF($F$9:$P$9,\"<>\",$F357:$P357),15-13*PO!$X$3))","v":1},{"$f":"OFFSET(PO!$P$12,ROW($E357)-ROW(F$12),0)","v":1}]
[{"$f":"OFFSET(PO!J$12,ROW(A358)-ROW($A$12),0)","v":"Serviço"},{"$f":"IF($A358=0,\"\",OFFSET(PO!K$12,ROW(B358)-ROW(B$12),0))","v":"23.0.3."},{"$f":"IF(OFFSET(PO!N$12,ROW(C358)-ROW(C$12),0)=0,\"\",OFFSET(PO!N$12,ROW(C358)-ROW(C$12),0))","v":"COBERTURA EM POLICARBONATO ALVEOLAR VERDE OU CRISTAL 10 MM E TERÇAS METÁLICAS COM PINTURA, INCLUSIVE EMENDAS E ACABAMENTOS, FIXADA NOS CAIBROS DOS PERGOLADOS - FORNECIMENTO E INSTALAÇÃO"},{"$f":"IF(OFFSET(PO!O$12,ROW(D358)-ROW(D$12),0)=0,\"\",OFFSET(PO!O$12,ROW(D358)-ROW(D$12),0))","v":"M²"},{"$f":"IF($A358<>\"Serviço\",0,ROUND(SUMIF($F$9:$P$9,\"<>\",$F358:$P358),15-13*PO!$X$3))","v":20},{"$f":"OFFSET(PO!$P$12,ROW($E358)-ROW(F$12),0)","v":20}]
[{"$f":"OFFSET(PO!J$12,ROW(A359)-ROW($A$12),0)","v":"Serviço"},{"$f":"IF($A359=0,\"\",OFFSET(PO!K$12,ROW(B359)-ROW(B$12),0))","v":"23.0.4."},{"$f":"IF(OFFSET(PO!N$12,ROW(C359)-ROW(C$12),0)=0,\"\",OFFSET(PO!N$12,ROW(C359)-ROW(C$12),0))","v":"BANCO EM CONCRETO E MADEIRA OU MADEIRA PLÁSTICA COM ENCOSTO, MEDIDAS MÍNIMAS 1,25 X 0,55 X ,70 M - FORNECIMENTO E INSTALAÇÃO"},{"$f":"IF(OFFSET(PO!O$12,ROW(D359)-ROW(D$12),0)=0,\"\",OFFSET(PO!O$12,ROW(D359)-ROW(D$12),0))","v":"UN"},{"$f":"IF($A359<>\"Serviço\",0,ROUND(SUMIF($F$9:$P$9,\"<>\",$F359:$P359),15-13*PO!$X$3))","v":5},{"$f":"OFFSET(PO!$P$12,ROW($E359)-ROW(F$12),0)","v":5}]
[{"$f":"OFFSET(PO!J$12,ROW(A360)-ROW($A$12),0)","v":"Serviço"},{"$f":"IF($A360=0,\"\",OFFSET(PO!K$12,ROW(B360)-ROW(B$12),0))","v":"23.0.5."},{"$f":"IF(OFFSET(PO!N$12,ROW(C360)-ROW(C$12),0)=0,\"\",OFFSET(PO!N$12,ROW(C360)-ROW(C$12),0))","v":"PLANTIO DE ÁRVORE ORNAMENTAL COM ALTURA DE MUDA MENOR OU IGUAL A 2,00 M. AF_05/2018"},{"$f":"IF(OFFSET(PO!O$12,ROW(D360)-ROW(D$12),0)=0,\"\",OFFSET(PO!O$12,ROW(D360)-ROW(D$12),0))","v":"UN"},{"$f":"IF($A360<>\"Serviço\",0,ROUND(SUMIF($F$9:$P$9,\"<>\",$F360:$P360),15-13*PO!$X$3))","v":3},{"$f":"OFFSET(PO!$P$12,ROW($E360)-ROW(F$12),0)","v":3}]
[{"$f":"OFFSET(PO!J$12,ROW(A361)-ROW($A$12),0)","v":"Serviço"},{"$f":"IF($A361=0,\"\",OFFSET(PO!K$12,ROW(B361)-ROW(B$12),0))","v":"23.0.6."},{"$f":"IF(OFFSET(PO!N$12,ROW(C361)-ROW(C$12),0)=0,\"\",OFFSET(PO!N$12,ROW(C361)-ROW(C$12),0))","v":"MUDA DE ARBUSTO FOLHAGEM, SANSAO-DO-CAMPO OU EQUIVALENTE DA REGIAO, H= *50 A 70* CM"},{"$f":"IF(OFFSET(PO!O$12,ROW(D361)-ROW(D$12),0)=0,\"\",OFFSET(PO!O$12,ROW(D361)-ROW(D$12),0))","v":"UN"},{"$f":"IF($A361<>\"Serviço\",0,ROUND(SUMIF($F$9:$P$9,\"<>\",$F361:$P361),15-13*PO!$X$3))","v":10},{"$f":"OFFSET(PO!$P$12,ROW($E361)-ROW(F$12),0)","v":10}]
[{"$f":"OFFSET(PO!J$12,ROW(A362)-ROW($A$12),0)","v":"Serviço"},{"$f":"IF($A362=0,\"\",OFFSET(PO!K$12,ROW(B362)-ROW(B$12),0))","v":"23.0.7."},{"$f":"IF(OFFSET(PO!N$12,ROW(C362)-ROW(C$12),0)=0,\"\",OFFSET(PO!N$12,ROW(C362)-ROW(C$12),0))","v":"GRANITO PARA BANCADA, POLIDO, TIPO ANDORINHA/ QUARTZ/ CASTELO/ CORUMBA OU OUTROS EQUIVALENTES DA REGIAO, E=  *2,5* CM"},{"$f":"IF(OFFSET(PO!O$12,ROW(D362)-ROW(D$12),0)=0,\"\",OFFSET(PO!O$12,ROW(D362)-ROW(D$12),0))","v":"M2"},{"$f":"IF($A362<>\"Serviço\",0,ROUND(SUMIF($F$9:$P$9,\"<>\",$F362:$P362),15-13*PO!$X$3))","v":1.2},{"$f":"OFFSET(PO!$P$12,ROW($E362)-ROW(F$12),0)","v":1.2}]
[{"$f":"OFFSET(PO!J$12,ROW(A363)-ROW($A$12),0)","v":"Serviço"},{"$f":"IF($A363=0,\"\",OFFSET(PO!K$12,ROW(B363)-ROW(B$12),0))","v":"23.0.8."},{"$f":"IF(OFFSET(PO!N$12,ROW(C363)-ROW(C$12),0)=0,\"\",OFFSET(PO!N$12,ROW(C363)-ROW(C$12),0))","v":"BANCADA DE GRANITO CINZA POLIDO PARA PIA DE COZINHA 1,50 X 0,60 M - FORNECIMENTO E INSTALAÇÃO. AF_12/2013"},{"$f":"IF(OFFSET(PO!O$12,ROW(D363)-ROW(D$12),0)=0,\"\",OFFSET(PO!O$12,ROW(D363)-ROW(D$12),0))","v":"UN"},{"$f":"IF($A363<>\"Serviço\",0,ROUND(SUMIF($F$9:$P$9,\"<>\",$F363:$P363),15-13*PO!$X$3))","v":1},{"$f":"OFFSET(PO!$P$12,ROW($E363)-ROW(F$12),0)","v":1}]
[{"$f":"OFFSET(PO!J$12,ROW(A364)-ROW($A$12),0)","v":"Serviço"},{"$f":"IF($A364=0,\"\",OFFSET(PO!K$12,ROW(B364)-ROW(B$12),0))","v":"23.0.9."},{"$f":"IF(OFFSET(PO!N$12,ROW(C364)-ROW(C$12),0)=0,\"\",OFFSET(PO!N$12,ROW(C364)-ROW(C$12),0))","v":"PLACA DE INAUGURACAO METALICA, *40* CM X *60* CM"},{"$f":"IF(OFFSET(PO!O$12,ROW(D364)-ROW(D$12),0)=0,\"\",OFFSET(PO!O$12,ROW(D364)-ROW(D$12),0))","v":"UN"},{"$f":"IF($A364<>\"Serviço\",0,ROUND(SUMIF($F$9:$P$9,\"<>\",$F364:$P364),15-13*PO!$X$3))","v":1},{"$f":"OFFSET(PO!$P$12,ROW($E364)-ROW(F$12),0)","v":1}]
[{"$f":"OFFSET(PO!J$12,ROW(A365)-ROW($A$12),0)","v":"Serviço"},{"$f":"IF($A365=0,\"\",OFFSET(PO!K$12,ROW(B365)-ROW(B$12),0))","v":"23.0.10."},{"$f":"IF(OFFSET(PO!N$12,ROW(C365)-ROW(C$12),0)=0,\"\",OFFSET(PO!N$12,ROW(C365)-ROW(C$12),0))","v":"LIMPEZA FINAL DA OBRA"},{"$f":"IF(OFFSET(PO!O$12,ROW(D365)-ROW(D$12),0)=0,\"\",OFFSET(PO!O$12,ROW(D365)-ROW(D$12),0))","v":"M2"},{"$f":"IF($A365<>\"Serviço\",0,ROUND(SUMIF($F$9:$P$9,\"<>\",$F365:$P365),15-13*PO!$X$3))","v":165.3},{"$f":"OFFSET(PO!$P$12,ROW($E365)-ROW(F$12),0)","v":165.3}]
[]
[]
[null,{"$f":"PO!$K$377","v":"CASEIROS/RS"}]
[null,"Local"]
[]
[null,{"$f":"PO!$K$380","v":"2018-10-30"}]
[null,"Data"]

{"sheet":"CFF","index":4,"n_rows":27,"n_cols":29,"rows_kept":27,"cut":false,"hidden":false,"merged":[[25,11,25,13],[10,11,12,11],[10,12,12,12],[13,11,16,12],[13,13,16,13],[17,11,19,11],[7,11,7,12],[10,13,12,13],[17,12,19,12],[17,13,19,13],[24,16,24,18],[24,12,24,13],[23,16,23,18],[22,16,22,18],[22,11,22,13],[23,12,23,13]]}
[null,null,null,null,null,null,null,null,null,null,null,null,null,null,"    CFF -","CRONOGRAMA FÍSICO-FINANCEIRO"]
[null,null,null,null,null,null,null,null,null,null,null,null,null,null,null,{"$f":"CHOOSE(1+LOG(1+2*(TipoOrçamento=\"BASE\")+4*(TipoOrçamento=\"LICITADO\")+8*(TipoOrçamento=\"REPROGRAMADOAC\")+16*(TipoOrçamento=\"REPROGRAMADONPL\"),2),\"nada\",\"Cronograma Base para Licitação\",\"Cronograma Licitado\",\"Cronograma Licitado Reprogramado\",\"Cronograma Base para Licitação - Reprogramado\")","v":"Cronograma Licitado"}]
[]
[]
[]
[]
[]
["Nível Máx Crono",null,null,null,null,null,null,null,null,null,null,{"$f":"IF(MAX($A$14:$A$22)<>MAX(PO!$V$12:$V$366),\"ERRO: CRONOGRAMA DESATUALIZADO\",IF(OR(COUNTIF($O$16:$X$16,\">1\")>0,OFFSET($X$17,0,-1)<>$N$14),\"ERRO: CRONOGRAMA NÃO FECHA EM 100%\",\"\"))","v":"ERRO: CRONOGRAMA DESATUALIZADO"},null,{"$f":"IF(TipoOrçamento=\"REPROGRAMADOAC\",\"Qtde de Medições realizadas\",\"\")","v":""}]
[2,null,null,null,null,null,null,null,null,null,null,null,null,1,{"$f":"IF(AND(TipoOrçamento=\"REPROGRAMADOAC\",$N$9>0),$N$9-1,0)","v":0},{"$f":"OFFSET(P9,0,-1)+1","v":1},2,3,4,5,6,7,8,null,null,null,null,null,{"$f":"OFFSET(AC9,0,-1)+1","v":1}]
["Lista Crono","Último Nível","Nível","Altura","N1","N2","N3","N4","Czero","Cnível","VTOTAL SOMA","Item","Descrição das Metas / Macrosserviços","Valores Totais (R$)",{"$f":"IF(TipoOrçamento=\"REPROGRAMADOAC\",\"Reinício de Obra\",\"Início de Obra\")&CHAR(10)&TEXT(DADOS!A48,\"dd/mm/aa\")","v":"Início de Obra\n01/09/18"},{"$f":"IF(AND(TipoOrçamento=\"REPROGRAMADOAC\",$N$9>0,N10=\"Valores Totais (R$)\"),\"Parcela \"&$N$9&\" Executado\",\"Parcela \"&P$9&CHAR(10)&TEXT(DATE(YEAR(DADOS!$A$48),MONTH(DADOS!$A$48)+P$9-IF(AND(TipoOrçamento=\"REPROGRAMADOAC\",$N$9>0),$N$9,0),1),\"mmm/aa\"))","v":"Parcela 1\nout/18"},{"$f":"IF(AND(TipoOrçamento=\"REPROGRAMADOAC\",$N$9>0,O10=\"Valores Totais (R$)\"),\"Parcela \"&$N$9&\" Executado\",\"Parcela \"&Q$9&CHAR(10)&TEXT(DATE(YEAR(DADOS!$A$48),MONTH(DADOS!$A$48)+Q$9-IF(AND(TipoOrçamento=\"REPROGRAMADOAC\",$N$9>0),$N$9,0),1),\"mmm/aa\"))","v":"Parcela 2\nnov/18"},{"$f":"IF(AND(TipoOrçamento=\"REPROGRAMADOAC\",$N$9>0,P10=\"Valores Totais (R$)\"),\"Parcela \"&$N$9&\" Executado\",\"Parcela \"&R$9&CHAR(10)&TEXT(DATE(YEAR(DADOS!$A$48),MONTH(DADOS!$A$48)+R$9-IF(AND(TipoOrçamento=\"REPROGRAMADOAC\",$N$9>0),$N$9,0),1),\"mmm/aa\"))","v":"Parcela 3\ndez/18"},{"$f":"IF(AND(TipoOrçamento=\"REPROGRAMADOAC\",$N$9>0,Q10=\"Valores Totais (R$)\"),\"Parcela \"&$N$9&\" Executado\",\"Parcela \"&S$9&CHAR(10)&TEXT(DATE(YEAR(DADOS!$A$48),MONTH(DADOS!$A$48)+S$9-IF(AND(TipoOrçamento=\"REPROGRAMADOAC\",$N$9>0),$N$9,0),1),\"mmm/aa\"))","v":"Parcela 4\njan/19"},{"$f":"IF(AND(TipoOrçamento=\"REPROGRAMADOAC\",$N$9>0,R10=\"Valores Totais (R$)\"),\"Parcela \"&$N$9&\" Executado\",\"Parcela \"&T$9&CHAR(10)&TEXT(DATE(YEAR(DADOS!$A$48),MONTH(DADOS!$A$48)+T$9-IF(AND(TipoOrçamento=\"REPROGRAMADOAC\",$N$9>0),$N$9,0),1),\"mmm/aa\"))","v":"Parcela 5\nfev/19"},{"$f":"IF(AND(TipoOrçamento=\"REPROGRAMADOAC\",$N$9>0,S10=\"Valores Totais (R$)\"),\"Parcela \"&$N$9&\" Executado\",\"Parcela \"&U$9&CHAR(10)&TEXT(DATE(YEAR(DADOS!$A$48),MONTH(DADOS!$A$48)+U$9-IF(AND(TipoOrçamento=\"REPROGRAMADOAC\",$N$9>0),$N$9,0),1),\"mmm/aa\"))","v":"Parcela 6\nmar/19"},{"$f":"IF(AND(TipoOrçamento=\"REPROGRAMADOAC\",$N$9>0,T10=\"Valores Totais (R$)\"),\"Parcela \"&$N$9&\" Executado\",\"Parcela \"&V$9&CHAR(10)&TEXT(DATE(YEAR(DADOS!$A$48),MONTH(DADOS!$A$48)+V$9-IF(AND(TipoOrçamento=\"REPROGRAMADOAC\",$N$9>0),$N$9,0),1),\"mmm/aa\"))","v":"Parcela 7\nabr/19"},{"$f":"IF(AND(TipoOrçamento=\"REPROGRAMADOAC\",$N$9>0,U10=\"Valores Totais (R$)\"),\"Parcela \"&$N$9&\" Executado\",\"Parcela \"&W$9&CHAR(10)&TEXT(DATE(YEAR(DADOS!$A$48),MONTH(DADOS!$A$48)+W$9-IF(AND(TipoOrçamento=\"REPROGRAMADOAC\",$N$9>0),$N$9,0),1),\"mmm/aa\"))","v":"Parcela 8\nmai/19"},null,null,null,null,null,{"$f":"IF(AND(TipoOrçamento=\"REPROGRAMADOAC\",$N$9>0,AA10=\"Valores Totais (R$)\"),\"Parcela \"&$N$9&\" Executado\",\"Parcela \"&AC$9&CHAR(10)&TEXT(DATE(YEAR(DADOS!$A$48),MONTH(DADOS!$A$48)+AC$9-IF(AND(TipoOrçamento=\"REPROGRAMADOAC\",$N$9>0),$N$9,0),1),\"mmm/aa\"))","v":"Parcela 1\nout/18"}]
[null,null,null,null,null,null,null,null,null,null,null,{"$f":"INDEX(PO!K$12:K$366,MATCH($A13,PO!$V$12:$V$366,0))","v":{"$error":"#VALUE!"}},{"$f":"INDEX(PO!N$12:N$366,MATCH($A13,PO!$V$12:$V$366,0))","v":{"$error":"#VALUE!"}},{"$f":"IF(ROUND(K13,2)=0,K13,ROUND(K13,2))","v":{"$error":"#VALUE!"}},"Parcela (%)",{"$f":"IF($B13,0,P12-IF(ISNUMBER(O12),O12,0))","v":{"$error":"#VALUE!"}},{"$f":"IF($B13,0,Q12-IF(ISNUMBER(P12),P12,0))","v":{"$error":"#VALUE!"}},{"$error":"#VALUE!"},{"$error":"#VALUE!"},{"$error":"#VALUE!"},{"$error":"#VALUE!"},{"$error":"#VALUE!"},{"$error":"#VALUE!"},null,null,null,null,null,{"$f":"IF($B13,0,AC12-IF(ISNUMBER(AB12),AB12,0))","v":{"$error":"#VALUE!"}}]
[null,null,null,null,null,null,null,null,null,null,null,null,null,null,"Acumulado (%)",{"$f":"MIN(IF($B13,P11+IF(ISNUMBER(O12),O12,0),P13/$N11),1)","v":{"$error":"#VALUE!"}},{"$f":"MIN(IF($B13,Q11+IF(ISNUMBER(P12),P12,0),Q13/$N11),1)","v":{"$error":"#VALUE!"}},{"$error":"#VALUE!"},{"$error":"#VALUE!"},{"$error":"#VALUE!"},{"$error":"#VALUE!"},{"$error":"#VALUE!"},{"$error":"#VALUE!"},null,null,null,null,null,{"$f":"MIN(IF($B13,AC11+IF(ISNUMBER(AB12),AB12,0),AC13/$N11),1)","v":{"$error":"#VALUE!"}}]
[{"$f":"OFFSET(A13,-CFF.NumLinha,0)+1","v":{"$error":"#VALUE!"}},{"$f":"$C13>=OFFSET($C13,CFF.NumLinha,0)","v":{"$error":"#VALUE!"}},{"$f":"INDEX(PO!A$12:A$366,MATCH($A13,PO!$V$12:$V$366,0))","v":{"$error":"#VALUE!"}},{"$f":"IF(ISERROR(J13),I13,SMALL(I13:J13,1))-1","v":{"$error":"#VALUE!"}},{"$f":"IF($C13=1,OFFSET(E13,-CFF.NumLinha,0)+1,OFFSET(E13,-CFF.NumLinha,0))","v":{"$error":"#VALUE!"}},{"$f":"IF($C13=1,0,IF($C13=2,OFFSET(F13,-CFF.NumLinha,0)+1,OFFSET(F13,-CFF.NumLinha,0)))","v":{"$error":"#VALUE!"}},{"$f":"IF(AND($C13<=2,$C13<>0),0,IF($C13=3,OFFSET(G13,-CFF.NumLinha,0)+1,OFFSET(G13,-CFF.NumLinha,0)))","v":{"$error":"#VALUE!"}},{"$f":"IF(AND($C13<=3,$C13<>0),0,IF($C13=4,OFFSET(H13,-CFF.NumLinha,0)+1,OFFSET(H13,-CFF.NumLinha,0)))","v":{"$error":"#VALUE!"}},{"$f":"MATCH(0,OFFSET($D13,1,$C13,ROW($A$21)-ROW($A13)),0)","v":{"$error":"#VALUE!"}},{"$f":"MATCH(OFFSET($D13,0,$C13)+1,OFFSET($D13,1,$C13,ROW($A$21)-ROW($A13)),0)","v":{"$error":"#VALUE!"}},{"$f":"ROUND(INDEX(PO!T$12:T$366,MATCH($A13,PO!$V$12:$V$366,0)),2)+10^-12","v":{"$error":"#VALUE!"}},null,null,null,"Acumulado (R$)",{"$f":"IF($B13,ROUND(P12*$N11,2),ROUND(SUMIF(OFFSET($B13,1,0,$D13),TRUE,OFFSET(P13,1,0,$D13))/SUMIF(OFFSET($B13,1,0,$D13),TRUE,OFFSET($K13,1,0,$D13))*$N11,2))","v":{"$error":"#VALUE!"}},{"$f":"IF($B13,ROUND(Q12*$N11,2),ROUND(SUMIF(OFFSET($B13,1,0,$D13),TRUE,OFFSET(Q13,1,0,$D13))/SUMIF(OFFSET($B13,1,0,$D13),TRUE,OFFSET($K13,1,0,$D13))*$N11,2))","v":{"$error":"#VALUE!"}},{"$error":"#VALUE!"},{"$error":"#VALUE!"},{"$error":"#VALUE!"},{"$error":"#VALUE!"},{"$error":"#VALUE!"},{"$error":"#VALUE!"},null,null,null,null,null,{"$f":"IF($B13,ROUND(AC12*$N11,2),ROUND(SUMIF(OFFSET($B13,1,0,$D13),TRUE,OFFSET(AC13,1,0,$D13))/SUMIF(OFFSET($B13,1,0,$D13),TRUE,OFFSET($K13,1,0,$D13))*$N11,2))","v":{"$error":"#VALUE!"}}]
[null,null,null,null,null,null,null,null,null,null,null,"CRONOGRAMA GLOBAL DO LOTE",null,{"$f":"IF(PO!$T$12=0,10^-12,PO!$T$12)","v":9.9999999999999998E-13},"Parcela (%)",{"$f":"ROUND(P15/$N14,4)","v":0},{"$f":"ROUND(Q15/$N14,4)","v":0},0,0,0,0,0,0,null,null,null,null,null,{"$f":"ROUND(AC15/$N14,4)","v":0}]
[null,null,null,null,null,null,null,null,null,null,null,null,null,null,"Parcela (R$)",{"$f":"P17-IF(ISNUMBER(O17),O17,0)","v":0},{"$f":"Q17-IF(ISNUMBER(P17),P17,0)","v":0},0,0,0,0,0,0,null,null,null,null,null,{"$f":"AC17-IF(ISNUMBER(AB17),AB17,0)","v":0}]
[null,null,null,null,null,null,null,null,null,null,null,null,null,null,"Acumulado (%)",{"$f":"ROUND(P17/$N14,4)","v":0},{"$f":"ROUND(Q17/$N14,4)","v":0},0,0,0,0,0,0,null,null,null,null,null,{"$f":"ROUND(AC17/$N14,4)","v":0}]
[0,null,null,{"$f":"ROW(D$21)-ROW(D18)","v":3},null,null,null,null,null,null,null,null,null,null,"Acumulado (R$)",{"$f":"SUMIF(OFFSET($C17,1,0):$C$21,1,OFFSET(P17,1,0):P$21)","v":0},{"$f":"SUMIF(OFFSET($C17,1,0):$C$21,1,OFFSET(Q17,1,0):Q$21)","v":0},{"$f":"SUMIF(OFFSET($C17,1,0):$C$21,1,OFFSET(R17,1,0):R$21)","v":0},{"$f":"SUMIF(OFFSET($C17,1,0):$C$21,1,OFFSET(S17,1,0):S$21)","v":0},{"$f":"SUMIF(OFFSET($C17,1,0):$C$21,1,OFFSET(T17,1,0):T$21)","v":0},{"$f":"SUMIF(OFFSET($C17,1,0):$C$21,1,OFFSET(U17,1,0):U$21)","v":0},{"$f":"SUMIF(OFFSET($C17,1,0):$C$21,1,OFFSET(V17,1,0):V$21)","v":0},{"$f":"SUMIF(OFFSET($C17,1,0):$C$21,1,OFFSET(W17,1,0):W$21)","v":0},null,null,null,null,null,{"$f":"SUMIF(OFFSET($C17,1,0):$C$21,1,OFFSET(AC17,1,0):AC$21)","v":0}]
[null,null,null,null,null,null,null,null,null,null,null,{"$f":"INDEX(PO!K$12:K$366,MATCH($A20,PO!$V$12:$V$366,0))","v":"1."},{"$f":"INDEX(PO!N$12:N$366,MATCH($A20,PO!$V$12:$V$366,0))","v":"SERVIÇOS PRELIMINARES"},{"$f":"IF(ROUND(K20,2)=0,K20,ROUND(K20,2))","v":9.9999999999999998E-13},"Parcela (%)",{"$f":"IF($B20,0,P19-IF(ISNUMBER(O19),O19,0))","v":0},0,0,0,0,0,0,0,"",null,null,null,null,{"$f":"IF($B20,0,AC19-IF(ISNUMBER(AB19),AB19,0))","v":0}]
[null,null,null,null,null,null,null,null,null,null,null,null,null,null,"Acumulado (%)",{"$f":"MIN(IF($B20,P18+IF(ISNUMBER(O19),O19,0),P20/$N18),1)","v":0},0,0,0,0,0,0,0,null,null,null,null,null,{"$f":"MIN(IF($B20,AC18+IF(ISNUMBER(AB19),AB19,0),AC20/$N18),1)","v":0}]
[{"$f":"OFFSET(A20,-CFF.NumLinha,0)+1","v":1},{"$f":"$C20>=OFFSET($C20,CFF.NumLinha,0)","v":true},{"$f":"INDEX(PO!A$12:A$366,MATCH($A20,PO!$V$12:$V$366,0))","v":1},{"$f":"IF(ISERROR(J20),I20,SMALL(I20:J20,1))-1","v":0},{"$f":"IF($C20=1,OFFSET(E20,-CFF.NumLinha,0)+1,OFFSET(E20,-CFF.NumLinha,0))","v":1},{"$f":"IF($C20=1,0,IF($C20=2,OFFSET(F20,-CFF.NumLinha,0)+1,OFFSET(F20,-CFF.NumLinha,0)))","v":0},{"$f":"IF(AND($C20<=2,$C20<>0),0,IF($C20=3,OFFSET(G20,-CFF.NumLinha,0)+1,OFFSET(G20,-CFF.NumLinha,0)))","v":0},{"$f":"IF(AND($C20<=3,$C20<>0),0,IF($C20=4,OFFSET(H20,-CFF.NumLinha,0)+1,OFFSET(H20,-CFF.NumLinha,0)))","v":0},{"$f":"MATCH(0,OFFSET($D20,1,$C20,ROW($A$21)-ROW($A20)),0)","v":1},{"$f":"MATCH(OFFSET($D20,0,$C20)+1,OFFSET($D20,1,$C20,ROW($A$21)-ROW($A20)),0)","v":{"$error":"#N/A"}},{"$f":"ROUND(INDEX(PO!T$12:T$366,MATCH($A20,PO!$V$12:$V$366,0)),2)+10^-12","v":9.9999999999999998E-13},null,null,null,"Acumulado (R$)",{"$f":"IF($B20,ROUND(P19*$N18,2),ROUND(SUMIF(OFFSET($B20,1,0,$D20),TRUE,OFFSET(P20,1,0,$D20))/SUMIF(OFFSET($B20,1,0,$D20),TRUE,OFFSET($K20,1,0,$D20))*$N18,2))","v":0},0,0,0,0,0,0,0,null,null,null,null,null,{"$f":"IF($B20,ROUND(AC19*$N18,2),ROUND(SUMIF(OFFSET($B20,1,0,$D20),TRUE,OFFSET(AC20,1,0,$D20))/SUMIF(OFFSET($B20,1,0,$D20),TRUE,OFFSET($K20,1,0,$D20))*$N18,2))","v":0}]
[null,null,-1,null,0,0,0,0]
[]
[null,null,null,null,null,null,null,null,null,null,null,{"$f":"DADOS!I32","v":0}]
[null,null,null,null,null,null,null,null,null,null,null,"Local"]
[]
[null,null,null,null,null,null,null,null,null,null,null,{"$f":"PO!K380","v":"2018-10-30"}]
[null,null,null,null,null,null,null,null,null,null,null,"Data"]